{"text_format":"1","workbook":"xlsx","n_sheets":14,"sheets":["Input","Input2","Input3","Legs","Teams","Gender","ResultsA","HardCopy1","ResultsB","HardCopy2","ResultsC","HardCopy3","ResultsD","HardCopy4"],"not_rendered":{"charts":0,"images":0,"macros":1,"external_links":0,"defined_names":8,"comments":0,"pivot_tables":0},"unopened":[],"bounds":{"document_bytes":16777216,"sheet_cells":100000,"rows_first":2000,"rows_last":500,"rows_between":2000,"halvings":0,"cell_chars":16384,"cell_head_chars":4096},"cells_cut":0,"cells_raw":0,"read":"whole","date_system":"1900"}

{"sheet":"Input","index":0,"n_rows":37,"n_cols":3,"rows_kept":37,"cut":false,"hidden":true,"merged":[]}
["Race Number","M/F/X","Club"]
[1,"Mens","Baildon Blokes"]
[2,"Ladies","Baildon Belles"]
[3,"Mixed","Oh Little Town of Baildon"]
[4,"Mixed","Baildon Away in Some Trainers"]
[5,"Mixed","Baildon Rudolf & his Red Nosed Oh Dears"]
[6,"Mens","Heptonstall Hurriers"]
[7,"Mixed","Otley A"]
[8,"Mixed","Otley B"]
[9,"Mens","Bingleys Santa's Supermen A Team"]
[10,"Mens","Bingley B Team Buffoons"]
[11,"Ladies","Bingley Belles Team 1"]
[12,"Ladies","Bingley Belles Team 2"]
[13,"Mixed","Bingley Boys & Girls "]
[14,"Mixed","Pudsey Pacer Comets"]
[15,"Mens","Pudsey Pacer Prancers"]
[16,"Ladies","Pudsey Pacer Vixens "]
[17,"Mixed ","KCAC Cononley Elite (?!) "]
[18,"Mixed","KCAC Magnificent 7+1 "]
[19,"Mixed","KCAC Total Strangers"]
[20,"Mixed","KCAC Santa's Trackers"]
[21,"Mens","KCAC Mens 1"]
[22,"Mens","KCAC Mens 2"]
[23,"Mixed","Queensbury Rams"]
[24,"Mixed","Queensbury Ewes"]
[25,"Mens","Craven Energy Blokes"]
[26,"Mixed","Craven Energy T'Others "]
[27,"Ladies","Barlick Ladies"]
[28,"Mens","Barlick A Team "]
[29,"Mens","Barlick's Jolly Joggers"]
[30,"Mens","X Team"]
[31,"Mens","Jimbobs Christmas All Stars 2"]
[32,"Ladies","Wharfedale Angels 1"]
[33,"Ladies","Wharfedale Angels 2"]
[34,"Mens","Wharfedale \"Wise Men\""]
[35,"Mixed","Wharfedale Mixed \"Winter Fools\""]
[36,"Ladies","Abbey Runners Womens"]

{"sheet":"Input2","index":1,"n_rows":289,"n_cols":6,"rows_kept":289,"cut":false,"hidden":true,"merged":[]}
["Race Number","Leg","M/F/X","Club","First Name","Surname"]
[1,"A","Mens","Baildon Blokes"]
[1,"A","Mens","Baildon Blokes"]
[1,"B","Mens","Baildon Blokes"]
[1,"B","Mens","Baildon Blokes"]
[1,"C","Mens","Baildon Blokes"]
[1,"C","Mens","Baildon Blokes"]
[1,"D","Mens","Baildon Blokes"]
[1,"D","Mens","Baildon Blokes"]
[2,"A","Ladies","Baildon Belles"]
[2,"A","Ladies","Baildon Belles"]
[2,"B","Ladies","Baildon Belles"]
[2,"B","Ladies","Baildon Belles"]
[2,"C","Ladies","Baildon Belles"]
[2,"C","Ladies","Baildon Belles"]
[2,"D","Ladies","Baildon Belles"]
[2,"D","Ladies","Baildon Belles"]
[3,"A","Mixed","Oh Little Town of Baildon"]
[3,"A","Mixed","Oh Little Town of Baildon"]
[3,"B","Mixed","Oh Little Town of Baildon"]
[3,"B","Mixed","Oh Little Town of Baildon"]
[3,"C","Mixed","Oh Little Town of Baildon"]
[3,"C","Mixed","Oh Little Town of Baildon"]
[3,"D","Mixed","Oh Little Town of Baildon"]
[3,"D","Mixed","Oh Little Town of Baildon"]
[4,"A","Mixed","Baildon Away in Some Trainers"]
[4,"A","Mixed","Baildon Away in Some Trainers"]
[4,"B","Mixed","Baildon Away in Some Trainers"]
[4,"B","Mixed","Baildon Away in Some Trainers"]
[4,"C","Mixed","Baildon Away in Some Trainers"]
[4,"C","Mixed","Baildon Away in Some Trainers"]
[4,"D","Mixed","Baildon Away in Some Trainers"]
[4,"D","Mixed","Baildon Away in Some Trainers"]
[5,"A","Mixed","Baildon Rudolf & his Red Nosed Oh Dears"]
[5,"A","Mixed","Baildon Rudolf & his Red Nosed Oh Dears"]
[5,"B","Mixed","Baildon Rudolf & his Red Nosed Oh Dears"]
[5,"B","Mixed","Baildon Rudolf & his Red Nosed Oh Dears"]
[5,"C","Mixed","Baildon Rudolf & his Red Nosed Oh Dears"]
[5,"C","Mixed","Baildon Rudolf & his Red Nosed Oh Dears"]
[5,"D","Mixed","Baildon Rudolf & his Red Nosed Oh Dears"]
[5,"D","Mixed","Baildon Rudolf & his Red Nosed Oh Dears"]
[6,"A","Mens","Heptonstall Hurriers"]
[6,"A","Mens","Heptonstall Hurriers"]
[6,"B","Mens","Heptonstall Hurriers"]
[6,"B","Mens","Heptonstall Hurriers"]
[6,"C","Mens","Heptonstall Hurriers"]
[6,"C","Mens","Heptonstall Hurriers"]
[6,"D","Mens","Heptonstall Hurriers"]
[6,"D","Mens","Heptonstall Hurriers"]
[7,"A","Mixed","Otley A"]
[7,"A","Mixed","Otley A"]
[7,"B","Mixed","Otley A"]
[7,"B","Mixed","Otley A"]
[7,"C","Mixed","Otley A"]
[7,"C","Mixed","Otley A"]
[7,"D","Mixed","Otley A"]
[7,"D","Mixed","Otley A"]
[8,"A","Mixed","Otley B"]
[8,"A","Mixed","Otley B"]
[8,"B","Mixed","Otley B"]
[8,"B","Mixed","Otley B"]
[8,"C","Mixed","Otley B"]
[8,"C","Mixed","Otley B"]
[8,"D","Mixed","Otley B"]
[8,"D","Mixed","Otley B"]
[9,"A","Mens","Bingleys Santa's Supermen A Team"]
[9,"A","Mens","Bingleys Santa's Supermen A Team"]
[9,"B","Mens","Bingleys Santa's Supermen A Team"]
[9,"B","Mens","Bingleys Santa's Supermen A Team"]
[9,"C","Mens","Bingleys Santa's Supermen A Team"]
[9,"C","Mens","Bingleys Santa's Supermen A Team"]
[9,"D","Mens","Bingleys Santa's Supermen A Team"]
[9,"D","Mens","Bingleys Santa's Supermen A Team"]
[10,"A","Mens","Bingley B Team Buffoons"]
[10,"A","Mens","Bingley B Team Buffoons"]
[10,"B","Mens","Bingley B Team Buffoons"]
[10,"B","Mens","Bingley B Team Buffoons"]
[10,"C","Mens","Bingley B Team Buffoons"]
[10,"C","Mens","Bingley B Team Buffoons"]
[10,"D","Mens","Bingley B Team Buffoons"]
[10,"D","Mens","Bingley B Team Buffoons"]
[11,"A","Ladies","Bingley Belles Team 1"]
[11,"A","Ladies","Bingley Belles Team 1"]
[11,"B","Ladies","Bingley Belles Team 1"]
[11,"B","Ladies","Bingley Belles Team 1"]
[11,"C","Ladies","Bingley Belles Team 1"]
[11,"C","Ladies","Bingley Belles Team 1"]
[11,"D","Ladies","Bingley Belles Team 1"]
[11,"D","Ladies","Bingley Belles Team 1"]
[12,"A","Ladies","Bingley Belles Team 2"]
[12,"A","Ladies","Bingley Belles Team 2"]
[12,"B","Ladies","Bingley Belles Team 2"]
[12,"B","Ladies","Bingley Belles Team 2"]
[12,"C","Ladies","Bingley Belles Team 2"]
[12,"C","Ladies","Bingley Belles Team 2"]
[12,"D","Ladies","Bingley Belles Team 2"]
[12,"D","Ladies","Bingley Belles Team 2"]
[13,"A","Mixed","Bingley Boys & Girls "]
[13,"A","Mixed","Bingley Boys & Girls "]
[13,"B","Mixed","Bingley Boys & Girls "]
[13,"B","Mixed","Bingley Boys & Girls "]
[13,"C","Mixed","Bingley Boys & Girls "]
[13,"C","Mixed","Bingley Boys & Girls "]
[13,"D","Mixed","Bingley Boys & Girls "]
[13,"D","Mixed","Bingley Boys & Girls "]
[14,"A","Mixed","Pudsey Pacer Comets"]
[14,"A","Mixed","Pudsey Pacer Comets"]
[14,"B","Mixed","Pudsey Pacer Comets"]
[14,"B","Mixed","Pudsey Pacer Comets"]
[14,"C","Mixed","Pudsey Pacer Comets"]
[14,"C","Mixed","Pudsey Pacer Comets"]
[14,"D","Mixed","Pudsey Pacer Comets"]
[14,"D","Mixed","Pudsey Pacer Comets"]
[15,"A","Mens","Pudsey Pacer Prancers"]
[15,"A","Mens","Pudsey Pacer Prancers"]
[15,"B","Mens","Pudsey Pacer Prancers"]
[15,"B","Mens","Pudsey Pacer Prancers"]
[15,"C","Mens","Pudsey Pacer Prancers"]
[15,"C","Mens","Pudsey Pacer Prancers"]
[15,"D","Mens","Pudsey Pacer Prancers"]
[15,"D","Mens","Pudsey Pacer Prancers"]
[16,"A","Ladies","Pudsey Pacer Vixens "]
[16,"A","Ladies","Pudsey Pacer Vixens "]
[16,"B","Ladies","Pudsey Pacer Vixens "]
[16,"B","Ladies","Pudsey Pacer Vixens "]
[16,"C","Ladies","Pudsey Pacer Vixens "]
[16,"C","Ladies","Pudsey Pacer Vixens "]
[16,"D","Ladies","Pudsey Pacer Vixens "]
[16,"D","Ladies","Pudsey Pacer Vixens "]
[17,"A","Mixed ","KCAC Cononley Elite (?!) "]
[17,"A","Mixed ","KCAC Cononley Elite (?!) "]
[17,"B","Mixed ","KCAC Cononley Elite (?!) "]
[17,"B","Mixed ","KCAC Cononley Elite (?!) "]
[17,"C","Mixed ","KCAC Cononley Elite (?!) "]
[17,"C","Mixed ","KCAC Cononley Elite (?!) "]
[17,"D","Mixed ","KCAC Cononley Elite (?!) "]
[17,"D","Mixed ","KCAC Cononley Elite (?!) "]
[18,"A","Mixed","KCAC Magnificent 7+1 "]
[18,"A","Mixed","KCAC Magnificent 7+1 "]
[18,"B","Mixed","KCAC Magnificent 7+1 "]
[18,"B","Mixed","KCAC Magnificent 7+1 "]
[18,"C","Mixed","KCAC Magnificent 7+1 "]
[18,"C","Mixed","KCAC Magnificent 7+1 "]
[18,"D","Mixed","KCAC Magnificent 7+1 "]
[18,"D","Mixed","KCAC Magnificent 7+1 "]
[19,"A","Mixed","KCAC Total Strangers"]
[19,"A","Mixed","KCAC Total Strangers"]
[19,"B","Mixed","KCAC Total Strangers"]
[19,"B","Mixed","KCAC Total Strangers"]
[19,"C","Mixed","KCAC Total Strangers"]
[19,"C","Mixed","KCAC Total Strangers"]
[19,"D","Mixed","KCAC Total Strangers"]
[19,"D","Mixed","KCAC Total Strangers"]
[20,"A","Mixed","KCAC Santa's Trackers"]
[20,"A","Mixed","KCAC Santa's Trackers"]
[20,"B","Mixed","KCAC Santa's Trackers"]
[20,"B","Mixed","KCAC Santa's Trackers"]
[20,"C","Mixed","KCAC Santa's Trackers"]
[20,"C","Mixed","KCAC Santa's Trackers"]
[20,"D","Mixed","KCAC Santa's Trackers"]
[20,"D","Mixed","KCAC Santa's Trackers"]
[21,"A","Mens","KCAC Mens 1"]
[21,"A","Mens","KCAC Mens 1"]
[21,"B","Mens","KCAC Mens 1"]
[21,"B","Mens","KCAC Mens 1"]
[21,"C","Mens","KCAC Mens 1"]
[21,"C","Mens","KCAC Mens 1"]
[21,"D","Mens","KCAC Mens 1"]
[21,"D","Mens","KCAC Mens 1"]
[22,"A","Mens","KCAC Mens 2"]
[22,"A","Mens","KCAC Mens 2"]
[22,"B","Mens","KCAC Mens 2"]
[22,"B","Mens","KCAC Mens 2"]
[22,"C","Mens","KCAC Mens 2"]
[22,"C","Mens","KCAC Mens 2"]
[22,"D","Mens","KCAC Mens 2"]
[22,"D","Mens","KCAC Mens 2"]
[23,"A","Mixed","Queensbury Rams"]
[23,"A","Mixed","Queensbury Rams"]
[23,"B","Mixed","Queensbury Rams"]
[23,"B","Mixed","Queensbury Rams"]
[23,"C","Mixed","Queensbury Rams"]
[23,"C","Mixed","Queensbury Rams"]
[23,"D","Mixed","Queensbury Rams"]
[23,"D","Mixed","Queensbury Rams"]
[24,"A","Mixed","Queensbury Ewes"]
[24,"A","Mixed","Queensbury Ewes"]
[24,"B","Mixed","Queensbury Ewes"]
[24,"B","Mixed","Queensbury Ewes"]
[24,"C","Mixed","Queensbury Ewes"]
[24,"C","Mixed","Queensbury Ewes"]
[24,"D","Mixed","Queensbury Ewes"]
[24,"D","Mixed","Queensbury Ewes"]
[25,"A","Mens","Craven Energy Blokes"]
[25,"A","Mens","Craven Energy Blokes"]
[25,"B","Mens","Craven Energy Blokes"]
[25,"B","Mens","Craven Energy Blokes"]
[25,"C","Mens","Craven Energy Blokes"]
[25,"C","Mens","Craven Energy Blokes"]
[25,"D","Mens","Craven Energy Blokes"]
[25,"D","Mens","Craven Energy Blokes"]
[26,"A","Mixed","Craven Energy T'Others "]
[26,"A","Mixed","Craven Energy T'Others "]
[26,"B","Mixed","Craven Energy T'Others "]
[26,"B","Mixed","Craven Energy T'Others "]
[26,"C","Mixed","Craven Energy T'Others "]
[26,"C","Mixed","Craven Energy T'Others "]
[26,"D","Mixed","Craven Energy T'Others "]
[26,"D","Mixed","Craven Energy T'Others "]
[27,"A","Ladies","Barlick Ladies"]
[27,"A","Ladies","Barlick Ladies"]
[27,"B","Ladies","Barlick Ladies"]
[27,"B","Ladies","Barlick Ladies"]
[27,"C","Ladies","Barlick Ladies"]
[27,"C","Ladies","Barlick Ladies"]
[27,"D","Ladies","Barlick Ladies"]
[27,"D","Ladies","Barlick Ladies"]
[28,"A","Mens","Barlick A Team "]
[28,"A","Mens","Barlick A Team "]
[28,"B","Mens","Barlick A Team "]
[28,"B","Mens","Barlick A Team "]
[28,"C","Mens","Barlick A Team "]
[28,"C","Mens","Barlick A Team "]
[28,"D","Mens","Barlick A Team "]
[28,"D","Mens","Barlick A Team "]
[29,"A","Mens","Barlick's Jolly Joggers"]
[29,"A","Mens","Barlick's Jolly Joggers"]
[29,"B","Mens","Barlick's Jolly Joggers"]
[29,"B","Mens","Barlick's Jolly Joggers"]
[29,"C","Mens","Barlick's Jolly Joggers"]
[29,"C","Mens","Barlick's Jolly Joggers"]
[29,"D","Mens","Barlick's Jolly Joggers"]
[29,"D","Mens","Barlick's Jolly Joggers"]
[30,"A","Mixed","X Team"]
[30,"A","Mixed","X Team"]
[30,"B","Mixed","X Team"]
[30,"B","Mixed","X Team"]
[30,"C","Mixed","X Team"]
[30,"C","Mixed","X Team"]
[30,"D","Mixed","X Team"]
[30,"D","Mixed","X Team"]
[31,"A","Mixed","Jimbobs Christmas All Stars 2"]
[31,"A","Mixed","Jimbobs Christmas All Stars 2"]
[31,"B","Mixed","Jimbobs Christmas All Stars 2"]
[31,"B","Mixed","Jimbobs Christmas All Stars 2"]
[31,"C","Mixed","Jimbobs Christmas All Stars 2"]
[31,"C","Mixed","Jimbobs Christmas All Stars 2"]
[31,"D","Mixed","Jimbobs Christmas All Stars 2"]
[31,"D","Mixed","Jimbobs Christmas All Stars 2"]
[32,"A","Ladies","Wharfedale Angels 1"]
[32,"A","Ladies","Wharfedale Angels 1"]
[32,"B","Ladies","Wharfedale Angels 1"]
[32,"B","Ladies","Wharfedale Angels 1"]
[32,"C","Ladies","Wharfedale Angels 1"]
[32,"C","Ladies","Wharfedale Angels 1"]
[32,"D","Ladies","Wharfedale Angels 1"]
[32,"D","Ladies","Wharfedale Angels 1"]
[33,"A","Ladies","Wharfedale Angels 2"]
[33,"A","Ladies","Wharfedale Angels 2"]
[33,"B","Ladies","Wharfedale Angels 2"]
[33,"B","Ladies","Wharfedale Angels 2"]
[33,"C","Ladies","Wharfedale Angels 2"]
[33,"C","Ladies","Wharfedale Angels 2"]
[33,"D","Ladies","Wharfedale Angels 2"]
[33,"D","Ladies","Wharfedale Angels 2"]
[34,"A","Mens","Wharfedale \"Wise Men\""]
[34,"A","Mens","Wharfedale \"Wise Men\""]
[34,"B","Mens","Wharfedale \"Wise Men\""]
[34,"B","Mens","Wharfedale \"Wise Men\""]
[34,"C","Mens","Wharfedale \"Wise Men\""]
[34,"C","Mens","Wharfedale \"Wise Men\""]
[34,"D","Mens","Wharfedale \"Wise Men\""]
[34,"D","Mens","Wharfedale \"Wise Men\""]
[35,"A","Mixed","Wharfedale Mixed \"Winter Fools\""]
[35,"A","Mixed","Wharfedale Mixed \"Winter Fools\""]
[35,"B","Mixed","Wharfedale Mixed \"Winter Fools\""]
[35,"B","Mixed","Wharfedale Mixed \"Winter Fools\""]
[35,"C","Mixed","Wharfedale Mixed \"Winter Fools\""]
[35,"C","Mixed","Wharfedale Mixed \"Winter Fools\""]
[35,"D","Mixed","Wharfedale Mixed \"Winter Fools\""]
[35,"D","Mixed","Wharfedale Mixed \"Winter Fools\""]
[36,"A","Ladies","Abbey Runners Womens"]
[36,"A","Ladies","Abbey Runners Womens"]
[36,"B","Ladies","Abbey Runners Womens"]
[36,"B","Ladies","Abbey Runners Womens"]
[36,"C","Ladies","Abbey Runners Womens"]
[36,"C","Ladies","Abbey Runners Womens"]
[36,"D","Ladies","Abbey Runners Womens"]
[36,"D","Ladies","Abbey Runners Womens"]

{"sheet":"Input3","index":2,"n_rows":145,"n_cols":4,"rows_kept":145,"cut":false,"hidden":true,"merged":[]}
["Race Number","Leg","M/F/X","Club"]
[1,"A","Mens","Baildon Blokes"]
[1,"B","Mens","Baildon Blokes"]
[1,"C","Mens","Baildon Blokes"]
[1,"D","Mens","Baildon Blokes"]
[2,"A","Ladies","Baildon Belles"]
[2,"B","Ladies","Baildon Belles"]
[2,"C","Ladies","Baildon Belles"]
[2,"D","Ladies","Baildon Belles"]
[3,"A","Mixed","Oh Little Town of Baildon"]
[3,"B","Mixed","Oh Little Town of Baildon"]
[3,"C","Mixed","Oh Little Town of Baildon"]
[3,"D","Mixed","Oh Little Town of Baildon"]
[4,"A","Mixed","Baildon Away in Some Trainers"]
[4,"B","Mixed","Baildon Away in Some Trainers"]
[4,"C","Mixed","Baildon Away in Some Trainers"]
[4,"D","Mixed","Baildon Away in Some Trainers"]
[5,"A","Mixed","Baildon Rudolf & his Red Nosed Oh Dears"]
[5,"B","Mixed","Baildon Rudolf & his Red Nosed Oh Dears"]
[5,"C","Mixed","Baildon Rudolf & his Red Nosed Oh Dears"]
[5,"D","Mixed","Baildon Rudolf & his Red Nosed Oh Dears"]
[6,"A","Mens","Heptonstall Hurriers"]
[6,"B","Mens","Heptonstall Hurriers"]
[6,"C","Mens","Heptonstall Hurriers"]
[6,"D","Mens","Heptonstall Hurriers"]
[7,"A","Mixed","Otley A"]
[7,"B","Mixed","Otley A"]
[7,"C","Mixed","Otley A"]
[7,"D","Mixed","Otley A"]
[8,"A","Mixed","Otley B"]
[8,"B","Mixed","Otley B"]
[8,"C","Mixed","Otley B"]
[8,"D","Mixed","Otley B"]
[9,"A","Mens","Bingleys Santa's Supermen A Team"]
[9,"B","Mens","Bingleys Santa's Supermen A Team"]
[9,"C","Mens","Bingleys Santa's Supermen A Team"]
[9,"D","Mens","Bingleys Santa's Supermen A Team"]
[10,"A","Mens","Bingley B Team Buffoons"]
[10,"B","Mens","Bingley B Team Buffoons"]
[10,"C","Mens","Bingley B Team Buffoons"]
[10,"D","Mens","Bingley B Team Buffoons"]
[11,"A","Ladies","Bingley Belles Team 1"]
[11,"B","Ladies","Bingley Belles Team 1"]
[11,"C","Ladies","Bingley Belles Team 1"]
[11,"D","Ladies","Bingley Belles Team 1"]
[12,"A","Ladies","Bingley Belles Team 2"]
[12,"B","Ladies","Bingley Belles Team 2"]
[12,"C","Ladies","Bingley Belles Team 2"]
[12,"D","Ladies","Bingley Belles Team 2"]
[13,"A","Mixed","Bingley Boys & Girls "]
[13,"B","Mixed","Bingley Boys & Girls "]
[13,"C","Mixed","Bingley Boys & Girls "]
[13,"D","Mixed","Bingley Boys & Girls "]
[14,"A","Mixed","Pudsey Pacer Comets"]
[14,"B","Mixed","Pudsey Pacer Comets"]
[14,"C","Mixed","Pudsey Pacer Comets"]
[14,"D","Mixed","Pudsey Pacer Comets"]
[15,"A","Mens","Pudsey Pacer Prancers"]
[15,"B","Mens","Pudsey Pacer Prancers"]
[15,"C","Mens","Pudsey Pacer Prancers"]
[15,"D","Mens","Pudsey Pacer Prancers"]
[16,"A","Ladies","Pudsey Pacer Vixens "]
[16,"B","Ladies","Pudsey Pacer Vixens "]
[16,"C","Ladies","Pudsey Pacer Vixens "]
[16,"D","Ladies","Pudsey Pacer Vixens "]
[17,"A","Mixed ","KCAC Cononley Grumblers"]
[17,"B","Mixed ","KCAC Cononley Grumblers"]
[17,"C","Mixed ","KCAC Cononley Grumblers"]
[17,"D","Mixed ","KCAC Cononley Grumblers"]
[18,"A","Mixed","KCAC Magnificent 7+1 "]
[18,"B","Mixed","KCAC Magnificent 7+1 "]
[18,"C","Mixed","KCAC Magnificent 7+1 "]
[18,"D","Mixed","KCAC Magnificent 7+1 "]
[19,"A","Mixed","KCAC Total Strangers"]
[19,"B","Mixed","KCAC Total Strangers"]
[19,"C","Mixed","KCAC Total Strangers"]
[19,"D","Mixed","KCAC Total Strangers"]
[20,"A","Mixed","KCAC Santa's Trackers"]
[20,"B","Mixed","KCAC Santa's Trackers"]
[20,"C","Mixed","KCAC Santa's Trackers"]
[20,"D","Mixed","KCAC Santa's Trackers"]
[21,"A","Mens","KCAC Mens 1"]
[21,"B","Mens","KCAC Mens 1"]
[21,"C","Mens","KCAC Mens 1"]
[21,"D","Mens","KCAC Mens 1"]
[22,"A","Mens","KCAC Mens 2"]
[22,"B","Mens","KCAC Mens 2"]
[22,"C","Mens","KCAC Mens 2"]
[22,"D","Mens","KCAC Mens 2"]
[23,"A","Mixed","Queensbury Rams"]
[23,"B","Mixed","Queensbury Rams"]
[23,"C","Mixed","Queensbury Rams"]
[23,"D","Mixed","Queensbury Rams"]
[24,"A","Mixed","Queensbury Ewes"]
[24,"B","Mixed","Queensbury Ewes"]
[24,"C","Mixed","Queensbury Ewes"]
[24,"D","Mixed","Queensbury Ewes"]
[25,"A","Mens","Craven Energy Blokes"]
[25,"B","Mens","Craven Energy Blokes"]
[25,"C","Mens","Craven Energy Blokes"]
[25,"D","Mens","Craven Energy Blokes"]
[26,"A","Mixed","Craven Energy T'Others "]
[26,"B","Mixed","Craven Energy T'Others "]
[26,"C","Mixed","Craven Energy T'Others "]
[26,"D","Mixed","Craven Energy T'Others "]
[27,"A","Ladies","Barlick Ladies"]
[27,"B","Ladies","Barlick Ladies"]
[27,"C","Ladies","Barlick Ladies"]
[27,"D","Ladies","Barlick Ladies"]
[28,"A","Mens","Barlick A Team "]
[28,"B","Mens","Barlick A Team "]
[28,"C","Mens","Barlick A Team "]
[28,"D","Mens","Barlick A Team "]
[29,"A","Mens","Barlick's Jolly Joggers"]
[29,"B","Mens","Barlick's Jolly Joggers"]
[29,"C","Mens","Barlick's Jolly Joggers"]
[29,"D","Mens","Barlick's Jolly Joggers"]
[30,"A","Mens","Jimbobs Christmas All Stars 1"]
[30,"B","Mens","Jimbobs Christmas All Stars 1"]
[30,"C","Mens","Jimbobs Christmas All Stars 1"]
[30,"D","Mens","Jimbobs Christmas All Stars 1"]
[31,"A","Mens","Jimbobs Christmas All Stars 2"]
[31,"B","Mens","Jimbobs Christmas All Stars 2"]
[31,"C","Mens","Jimbobs Christmas All Stars 2"]
[31,"D","Mens","Jimbobs Christmas All Stars 2"]
[32,"A","Ladies","Wharfedale Angels 1"]
[32,"B","Ladies","Wharfedale Angels 1"]
[32,"C","Ladies","Wharfedale Angels 1"]
[32,"D","Ladies","Wharfedale Angels 1"]
[33,"A","Ladies","Wharfedale Angels 2"]
[33,"B","Ladies","Wharfedale Angels 2"]
[33,"C","Ladies","Wharfedale Angels 2"]
[33,"D","Ladies","Wharfedale Angels 2"]
[34,"A","Mens","Wharfedale \"Wise Men\""]
[34,"B","Mens","Wharfedale \"Wise Men\""]
[34,"C","Mens","Wharfedale \"Wise Men\""]
[34,"D","Mens","Wharfedale \"Wise Men\""]
[35,"A","Mixed","Wharfedale Mixed \"Winter Fools\""]
[35,"B","Mixed","Wharfedale Mixed \"Winter Fools\""]
[35,"C","Mixed","Wharfedale Mixed \"Winter Fools\""]
[35,"D","Mixed","Wharfedale Mixed \"Winter Fools\""]
[36,"A","Ladies","Abbey Runners Womens"]
[36,"B","Ladies","Abbey Runners Womens"]
[36,"C","Ladies","Abbey Runners Womens"]
[36,"D","Ladies","Abbey Runners Womens"]

{"sheet":"Legs","index":3,"n_rows":52,"n_cols":19,"rows_kept":52,"cut":false,"hidden":false,"merged":[]}
[]
[null,"Position","Number","Club","Cuml Time","M/F/X","Leg1","LegPos1","Leg2","LegPos2","Leg3","LegPos3","Leg4","Finish","Leg 2+3 >MST","FT1","FT2","FT3","FT4"]
[null,1,{"$f":"IF(ResultsD!B2=\"\",\"\",ResultsD!B2)","v":31},{"$f":"IFERROR(VLOOKUP(C3,Teams!$A$2:$B$51,2,0),\"\")","v":"Bingley A Holes"},{"$f":"IFERROR((G3+I3+K3+M3+O3),\"\")","v":"03:30:49"},{"$f":"IFERROR(VLOOKUP(C3,Teams!$A$2:$D$51,4,0),\"\")","v":"Male"},{"$f":"IFERROR(VLOOKUP($C3,ResultsA!$B$2:$K$51,10,0),\"\")","v":"01:00:17"},{"$f":"IFERROR(VLOOKUP($C3,ResultsA!$B$2:$N$52,13,0),\"\")","v":1},{"$f":"IFERROR(VLOOKUP($C3,ResultsB!$B$2:$K$51,10,0),\"\")","v":"01:06:29"},{"$f":"IFERROR(VLOOKUP($C3,ResultsB!$B$2:$N$52,13,0),\"\")","v":1},{"$f":"IFERROR(VLOOKUP($C3,ResultsC!$B$2:$K$51,10,0),\"\")","v":"00:35:34"},{"$f":"IFERROR(VLOOKUP($C3,ResultsC!$B$2:$N$51,13,0),\"\")","v":1},{"$f":"IFERROR(VLOOKUP($C3,ResultsD!$B$2:$I$51,8,0),\"\")","v":"00:48:29"},{"$f":"IF(C3=\"\",\"\",B3)","v":1},{"$f":"IFERROR(VLOOKUP(C3,ResultsC!$B$2:$J$51,9,0)+VLOOKUP(C3,ResultsB!$B$2:$J$51,9,0),\"\")","v":"00:00:00"},{"$f":"H3","v":1},{"$f":"IFERROR(RANK(I3,I$3:I$52,1),\"\")","v":2},{"$f":"IFERROR(RANK(K3,K$3:K$52,1),\"\")","v":1},{"$f":"IFERROR(RANK(M3,M$3:M$52,1),\"\")","v":1}]
[null,2,{"$f":"IF(ResultsD!B3=\"\",\"\",ResultsD!B3)","v":52},{"$f":"IFERROR(VLOOKUP(C4,Teams!$A$2:$B$51,2,0),\"\")","v":"Keighley & Craven A "},"03:46:14",{"$f":"IFERROR(VLOOKUP(C4,Teams!$A$2:$D$51,4,0),\"\")","v":"Male"},{"$f":"IFERROR(VLOOKUP($C4,ResultsA!$B$2:$K$51,10,0),\"\")","v":"01:09:34"},{"$f":"IFERROR(VLOOKUP($C4,ResultsA!$B$2:$N$52,13,0),\"\")","v":5},{"$f":"IFERROR(VLOOKUP($C4,ResultsB!$B$2:$K$51,10,0),\"\")","v":"01:06:53"},{"$f":"IFERROR(VLOOKUP($C4,ResultsB!$B$2:$N$52,13,0),\"\")","v":3},{"$f":"IFERROR(VLOOKUP($C4,ResultsC!$B$2:$K$51,10,0),\"\")","v":"00:39:17"},{"$f":"IFERROR(VLOOKUP($C4,ResultsC!$B$2:$N$51,13,0),\"\")","v":2},{"$f":"IFERROR(VLOOKUP($C4,ResultsD!$B$2:$I$51,8,0),\"\")","v":"00:50:30"},2,{"$f":"IFERROR(VLOOKUP(C4,ResultsC!$B$2:$J$51,9,0)+VLOOKUP(C4,ResultsB!$B$2:$J$51,9,0),\"\")","v":"00:00:00"},5,3,2,4]
[null,3,{"$f":"IF(ResultsD!B4=\"\",\"\",ResultsD!B4)","v":36},{"$f":"IFERROR(VLOOKUP(C5,Teams!$A$2:$B$51,2,0),\"\")","v":"Annie's Dream Team"},"04:00:09",{"$f":"IFERROR(VLOOKUP(C5,Teams!$A$2:$D$51,4,0),\"\")","v":"Mixed"},{"$f":"IFERROR(VLOOKUP($C5,ResultsA!$B$2:$K$51,10,0),\"\")","v":"01:04:12"},{"$f":"IFERROR(VLOOKUP($C5,ResultsA!$B$2:$N$52,13,0),\"\")","v":3},{"$f":"IFERROR(VLOOKUP($C5,ResultsB!$B$2:$K$51,10,0),\"\")","v":"01:03:29"},{"$f":"IFERROR(VLOOKUP($C5,ResultsB!$B$2:$N$52,13,0),\"\")","v":2},{"$f":"IFERROR(VLOOKUP($C5,ResultsC!$B$2:$K$51,10,0),\"\")","v":"00:53:21"},{"$f":"IFERROR(VLOOKUP($C5,ResultsC!$B$2:$N$51,13,0),\"\")","v":3},{"$f":"IFERROR(VLOOKUP($C5,ResultsD!$B$2:$I$51,8,0),\"\")","v":"00:59:07"},3,{"$f":"IFERROR(VLOOKUP(C5,ResultsC!$B$2:$J$51,9,0)+VLOOKUP(C5,ResultsB!$B$2:$J$51,9,0),\"\")","v":"00:00:00"},3,1,19,9]
[null,4,{"$f":"IF(ResultsD!B5=\"\",\"\",ResultsD!B5)","v":48},{"$f":"IFERROR(VLOOKUP(C6,Teams!$A$2:$B$51,2,0),\"\")","v":"Rudolf Needs A Vet"},"04:05:15",{"$f":"IFERROR(VLOOKUP(C6,Teams!$A$2:$D$51,4,0),\"\")","v":"Mixed"},{"$f":"IFERROR(VLOOKUP($C6,ResultsA!$B$2:$K$51,10,0),\"\")","v":"01:18:12"},{"$f":"IFERROR(VLOOKUP($C6,ResultsA!$B$2:$N$52,13,0),\"\")","v":13},{"$f":"IFERROR(VLOOKUP($C6,ResultsB!$B$2:$K$51,10,0),\"\")","v":"01:17:37"},{"$f":"IFERROR(VLOOKUP($C6,ResultsB!$B$2:$N$52,13,0),\"\")","v":13},{"$f":"IFERROR(VLOOKUP($C6,ResultsC!$B$2:$K$51,10,0),\"\")","v":"00:40:27"},{"$f":"IFERROR(VLOOKUP($C6,ResultsC!$B$2:$N$51,13,0),\"\")","v":6},{"$f":"IFERROR(VLOOKUP($C6,ResultsD!$B$2:$I$51,8,0),\"\")","v":"00:48:59"},4,{"$f":"IFERROR(VLOOKUP(C6,ResultsC!$B$2:$J$51,9,0)+VLOOKUP(C6,ResultsB!$B$2:$J$51,9,0),\"\")","v":"00:00:00"},13,11,4,2]
[null,5,{"$f":"IF(ResultsD!B6=\"\",\"\",ResultsD!B6)","v":32},{"$f":"IFERROR(VLOOKUP(C7,Teams!$A$2:$B$51,2,0),\"\")","v":"Bingley B Stards"},"04:07:17",{"$f":"IFERROR(VLOOKUP(C7,Teams!$A$2:$D$51,4,0),\"\")","v":"Male"},{"$f":"IFERROR(VLOOKUP($C7,ResultsA!$B$2:$K$51,10,0),\"\")","v":"01:10:27"},{"$f":"IFERROR(VLOOKUP($C7,ResultsA!$B$2:$N$52,13,0),\"\")","v":7},{"$f":"IFERROR(VLOOKUP($C7,ResultsB!$B$2:$K$51,10,0),\"\")","v":"01:26:26"},{"$f":"IFERROR(VLOOKUP($C7,ResultsB!$B$2:$N$52,13,0),\"\")","v":15},{"$f":"IFERROR(VLOOKUP($C7,ResultsC!$B$2:$K$51,10,0),\"\")","v":"00:41:00"},{"$f":"IFERROR(VLOOKUP($C7,ResultsC!$B$2:$N$51,13,0),\"\")","v":8},{"$f":"IFERROR(VLOOKUP($C7,ResultsD!$B$2:$I$51,8,0),\"\")","v":"00:49:24"},5,{"$f":"IFERROR(VLOOKUP(C7,ResultsC!$B$2:$J$51,9,0)+VLOOKUP(C7,ResultsB!$B$2:$J$51,9,0),\"\")","v":"00:00:00"},7,17,5,3]
[null,6,{"$f":"IF(ResultsD!B7=\"\",\"\",ResultsD!B7)","v":49},{"$f":"IFERROR(VLOOKUP(C8,Teams!$A$2:$B$51,2,0),\"\")","v":"Real Men Wear Pink"},"04:11:18",{"$f":"IFERROR(VLOOKUP(C8,Teams!$A$2:$D$51,4,0),\"\")","v":"Mixed"},{"$f":"IFERROR(VLOOKUP($C8,ResultsA!$B$2:$K$51,10,0),\"\")","v":"01:03:57"},{"$f":"IFERROR(VLOOKUP($C8,ResultsA!$B$2:$N$52,13,0),\"\")","v":2},{"$f":"IFERROR(VLOOKUP($C8,ResultsB!$B$2:$K$51,10,0),\"\")","v":"01:17:27"},{"$f":"IFERROR(VLOOKUP($C8,ResultsB!$B$2:$N$52,13,0),\"\")","v":4},{"$f":"IFERROR(VLOOKUP($C8,ResultsC!$B$2:$K$51,10,0),\"\")","v":"00:40:19"},{"$f":"IFERROR(VLOOKUP($C8,ResultsC!$B$2:$N$51,13,0),\"\")","v":4},{"$f":"IFERROR(VLOOKUP($C8,ResultsD!$B$2:$I$51,8,0),\"\")","v":"01:09:35"},6,{"$f":"IFERROR(VLOOKUP(C8,ResultsC!$B$2:$J$51,9,0)+VLOOKUP(C8,ResultsB!$B$2:$J$51,9,0),\"\")","v":"00:00:00"},2,10,3,20]
[null,7,{"$f":"IF(ResultsD!B8=\"\",\"\",ResultsD!B8)","v":50},{"$f":"IFERROR(VLOOKUP(C9,Teams!$A$2:$B$51,2,0),\"\")","v":"Barlick 3 Belles"},"04:11:29",{"$f":"IFERROR(VLOOKUP(C9,Teams!$A$2:$D$51,4,0),\"\")","v":"Female"},{"$f":"IFERROR(VLOOKUP($C9,ResultsA!$B$2:$K$51,10,0),\"\")","v":"01:12:50"},{"$f":"IFERROR(VLOOKUP($C9,ResultsA!$B$2:$N$52,13,0),\"\")","v":10},{"$f":"IFERROR(VLOOKUP($C9,ResultsB!$B$2:$K$51,10,0),\"\")","v":"01:13:45"},{"$f":"IFERROR(VLOOKUP($C9,ResultsB!$B$2:$N$52,13,0),\"\")","v":5},{"$f":"IFERROR(VLOOKUP($C9,ResultsC!$B$2:$K$51,10,0),\"\")","v":"00:42:20"},{"$f":"IFERROR(VLOOKUP($C9,ResultsC!$B$2:$N$51,13,0),\"\")","v":5},{"$f":"IFERROR(VLOOKUP($C9,ResultsD!$B$2:$I$51,8,0),\"\")","v":"01:02:34"},7,{"$f":"IFERROR(VLOOKUP(C9,ResultsC!$B$2:$J$51,9,0)+VLOOKUP(C9,ResultsB!$B$2:$J$51,9,0),\"\")","v":"00:00:00"},10,6,6,13]
[null,8,{"$f":"IF(ResultsD!B9=\"\",\"\",ResultsD!B9)","v":53},{"$f":"IFERROR(VLOOKUP(C10,Teams!$A$2:$B$51,2,0),\"\")","v":"Keighley & Craven B"},"04:14:06",{"$f":"IFERROR(VLOOKUP(C10,Teams!$A$2:$D$51,4,0),\"\")","v":"Male"},{"$f":"IFERROR(VLOOKUP($C10,ResultsA!$B$2:$K$51,10,0),\"\")","v":"01:14:11"},{"$f":"IFERROR(VLOOKUP($C10,ResultsA!$B$2:$N$52,13,0),\"\")","v":12},{"$f":"IFERROR(VLOOKUP($C10,ResultsB!$B$2:$K$51,10,0),\"\")","v":"01:21:28"},{"$f":"IFERROR(VLOOKUP($C10,ResultsB!$B$2:$N$52,13,0),\"\")","v":12},{"$f":"IFERROR(VLOOKUP($C10,ResultsC!$B$2:$K$51,10,0),\"\")","v":"00:44:21"},{"$f":"IFERROR(VLOOKUP($C10,ResultsC!$B$2:$N$51,13,0),\"\")","v":9},{"$f":"IFERROR(VLOOKUP($C10,ResultsD!$B$2:$I$51,8,0),\"\")","v":"00:54:06"},8,{"$f":"IFERROR(VLOOKUP(C10,ResultsC!$B$2:$J$51,9,0)+VLOOKUP(C10,ResultsB!$B$2:$J$51,9,0),\"\")","v":"00:00:00"},12,15,7,5]
[null,9,{"$f":"IF(ResultsD!B10=\"\",\"\",ResultsD!B10)","v":37},{"$f":"IFERROR(VLOOKUP(C11,Teams!$A$2:$B$51,2,0),\"\")","v":"Doddy Superhero"},"04:18:28",{"$f":"IFERROR(VLOOKUP(C11,Teams!$A$2:$D$51,4,0),\"\")","v":"Mixed"},{"$f":"IFERROR(VLOOKUP($C11,ResultsA!$B$2:$K$51,10,0),\"\")","v":"01:13:32"},{"$f":"IFERROR(VLOOKUP($C11,ResultsA!$B$2:$N$52,13,0),\"\")","v":11},{"$f":"IFERROR(VLOOKUP($C11,ResultsB!$B$2:$K$51,10,0),\"\")","v":"01:16:10"},{"$f":"IFERROR(VLOOKUP($C11,ResultsB!$B$2:$N$52,13,0),\"\")","v":6},{"$f":"IFERROR(VLOOKUP($C11,ResultsC!$B$2:$K$51,10,0),\"\")","v":"00:47:07"},{"$f":"IFERROR(VLOOKUP($C11,ResultsC!$B$2:$N$51,13,0),\"\")","v":7},{"$f":"IFERROR(VLOOKUP($C11,ResultsD!$B$2:$I$51,8,0),\"\")","v":"01:01:39"},9,{"$f":"IFERROR(VLOOKUP(C11,ResultsC!$B$2:$J$51,9,0)+VLOOKUP(C11,ResultsB!$B$2:$J$51,9,0),\"\")","v":"00:00:00"},11,8,8,12]
[null,10,{"$f":"IF(ResultsD!B11=\"\",\"\",ResultsD!B11)","v":39},{"$f":"IFERROR(VLOOKUP(C12,Teams!$A$2:$B$51,2,0),\"\")","v":"St Nicks"},"04:21:30",{"$f":"IFERROR(VLOOKUP(C12,Teams!$A$2:$D$51,4,0),\"\")","v":"Mixed"},{"$f":"IFERROR(VLOOKUP($C12,ResultsA!$B$2:$K$51,10,0),\"\")","v":"01:10:07"},{"$f":"IFERROR(VLOOKUP($C12,ResultsA!$B$2:$N$52,13,0),\"\")","v":6},{"$f":"IFERROR(VLOOKUP($C12,ResultsB!$B$2:$K$51,10,0),\"\")","v":"01:19:42"},{"$f":"IFERROR(VLOOKUP($C12,ResultsB!$B$2:$N$52,13,0),\"\")","v":7},{"$f":"IFERROR(VLOOKUP($C12,ResultsC!$B$2:$K$51,10,0),\"\")","v":"00:53:59"},{"$f":"IFERROR(VLOOKUP($C12,ResultsC!$B$2:$N$51,13,0),\"\")","v":13},{"$f":"IFERROR(VLOOKUP($C12,ResultsD!$B$2:$I$51,8,0),\"\")","v":"00:57:42"},10,{"$f":"IFERROR(VLOOKUP(C12,ResultsC!$B$2:$J$51,9,0)+VLOOKUP(C12,ResultsB!$B$2:$J$51,9,0),\"\")","v":"00:00:00"},6,13,20,7]
[null,11,{"$f":"IF(ResultsD!B12=\"\",\"\",ResultsD!B12)","v":55},{"$f":"IFERROR(VLOOKUP(C13,Teams!$A$2:$B$51,2,0),\"\")","v":"Bingley Angels"},"04:25:34",{"$f":"IFERROR(VLOOKUP(C13,Teams!$A$2:$D$51,4,0),\"\")","v":"Female"},{"$f":"IFERROR(VLOOKUP($C13,ResultsA!$B$2:$K$51,10,0),\"\")","v":"01:18:52"},{"$f":"IFERROR(VLOOKUP($C13,ResultsA!$B$2:$N$52,13,0),\"\")","v":14},{"$f":"IFERROR(VLOOKUP($C13,ResultsB!$B$2:$K$51,10,0),\"\")","v":"01:19:34"},{"$f":"IFERROR(VLOOKUP($C13,ResultsB!$B$2:$N$52,13,0),\"\")","v":16},{"$f":"IFERROR(VLOOKUP($C13,ResultsC!$B$2:$K$51,10,0),\"\")","v":"00:48:20"},{"$f":"IFERROR(VLOOKUP($C13,ResultsC!$B$2:$N$51,13,0),\"\")","v":15},{"$f":"IFERROR(VLOOKUP($C13,ResultsD!$B$2:$I$51,8,0),\"\")","v":"00:58:48"},11,{"$f":"IFERROR(VLOOKUP(C13,ResultsC!$B$2:$J$51,9,0)+VLOOKUP(C13,ResultsB!$B$2:$J$51,9,0),\"\")","v":"00:00:00"},14,12,12,8]
[null,12,{"$f":"IF(ResultsD!B13=\"\",\"\",ResultsD!B13)","v":35},{"$f":"IFERROR(VLOOKUP(C14,Teams!$A$2:$B$51,2,0),\"\")","v":"Skipton"},"04:26:54",{"$f":"IFERROR(VLOOKUP(C14,Teams!$A$2:$D$51,4,0),\"\")","v":"Mixed"},{"$f":"IFERROR(VLOOKUP($C14,ResultsA!$B$2:$K$51,10,0),\"\")","v":"01:22:07"},{"$f":"IFERROR(VLOOKUP($C14,ResultsA!$B$2:$N$52,13,0),\"\")","v":21},{"$f":"IFERROR(VLOOKUP($C14,ResultsB!$B$2:$K$51,10,0),\"\")","v":"01:13:20"},{"$f":"IFERROR(VLOOKUP($C14,ResultsB!$B$2:$N$52,13,0),\"\")","v":11},{"$f":"IFERROR(VLOOKUP($C14,ResultsC!$B$2:$K$51,10,0),\"\")","v":"00:47:43"},{"$f":"IFERROR(VLOOKUP($C14,ResultsC!$B$2:$N$51,13,0),\"\")","v":11},{"$f":"IFERROR(VLOOKUP($C14,ResultsD!$B$2:$I$51,8,0),\"\")","v":"01:03:44"},12,{"$f":"IFERROR(VLOOKUP(C14,ResultsC!$B$2:$J$51,9,0)+VLOOKUP(C14,ResultsB!$B$2:$J$51,9,0),\"\")","v":"00:00:00"},21,5,11,16]
[null,13,{"$f":"IF(ResultsD!B14=\"\",\"\",ResultsD!B14)","v":44},{"$f":"IFERROR(VLOOKUP(C15,Teams!$A$2:$B$51,2,0),\"\")","v":"K & C Arsey Amblers"},"04:27:10",{"$f":"IFERROR(VLOOKUP(C15,Teams!$A$2:$D$51,4,0),\"\")","v":"Female"},{"$f":"IFERROR(VLOOKUP($C15,ResultsA!$B$2:$K$51,10,0),\"\")","v":"01:19:22"},{"$f":"IFERROR(VLOOKUP($C15,ResultsA!$B$2:$N$52,13,0),\"\")","v":15},{"$f":"IFERROR(VLOOKUP($C15,ResultsB!$B$2:$K$51,10,0),\"\")","v":"01:16:31"},{"$f":"IFERROR(VLOOKUP($C15,ResultsB!$B$2:$N$52,13,0),\"\")","v":14},{"$f":"IFERROR(VLOOKUP($C15,ResultsC!$B$2:$K$51,10,0),\"\")","v":"00:47:10"},{"$f":"IFERROR(VLOOKUP($C15,ResultsC!$B$2:$N$51,13,0),\"\")","v":10},{"$f":"IFERROR(VLOOKUP($C15,ResultsD!$B$2:$I$51,8,0),\"\")","v":"01:04:07"},13,{"$f":"IFERROR(VLOOKUP(C15,ResultsC!$B$2:$J$51,9,0)+VLOOKUP(C15,ResultsB!$B$2:$J$51,9,0),\"\")","v":"00:00:00"},15,9,9,18]
[null,14,{"$f":"IF(ResultsD!B15=\"\",\"\",ResultsD!B15)","v":38},{"$f":"IFERROR(VLOOKUP(C16,Teams!$A$2:$B$51,2,0),\"\")","v":"Kirkham MX"},"04:27:19",{"$f":"IFERROR(VLOOKUP(C16,Teams!$A$2:$D$51,4,0),\"\")","v":"Mixed"},{"$f":"IFERROR(VLOOKUP($C16,ResultsA!$B$2:$K$51,10,0),\"\")","v":"01:26:27"},{"$f":"IFERROR(VLOOKUP($C16,ResultsA!$B$2:$N$52,13,0),\"\")","v":22},{"$f":"IFERROR(VLOOKUP($C16,ResultsB!$B$2:$K$51,10,0),\"\")","v":"01:08:26"},{"$f":"IFERROR(VLOOKUP($C16,ResultsB!$B$2:$N$52,13,0),\"\")","v":10},{"$f":"IFERROR(VLOOKUP($C16,ResultsC!$B$2:$K$51,10,0),\"\")","v":"00:48:27"},{"$f":"IFERROR(VLOOKUP($C16,ResultsC!$B$2:$N$51,13,0),\"\")","v":12},{"$f":"IFERROR(VLOOKUP($C16,ResultsD!$B$2:$I$51,8,0),\"\")","v":"01:03:59"},14,{"$f":"IFERROR(VLOOKUP(C16,ResultsC!$B$2:$J$51,9,0)+VLOOKUP(C16,ResultsB!$B$2:$J$51,9,0),\"\")","v":"00:00:00"},22,4,13,17]
[null,15,{"$f":"IF(ResultsD!B16=\"\",\"\",ResultsD!B16)","v":33},{"$f":"IFERROR(VLOOKUP(C17,Teams!$A$2:$B$51,2,0),\"\")","v":"Bingley C Rappers"},"04:27:27",{"$f":"IFERROR(VLOOKUP(C17,Teams!$A$2:$D$51,4,0),\"\")","v":"Male"},{"$f":"IFERROR(VLOOKUP($C17,ResultsA!$B$2:$K$51,10,0),\"\")","v":"01:11:10"},{"$f":"IFERROR(VLOOKUP($C17,ResultsA!$B$2:$N$52,13,0),\"\")","v":8},{"$f":"IFERROR(VLOOKUP($C17,ResultsB!$B$2:$K$51,10,0),\"\")","v":"01:20:20"},{"$f":"IFERROR(VLOOKUP($C17,ResultsB!$B$2:$N$52,13,0),\"\")","v":8},{"$f":"IFERROR(VLOOKUP($C17,ResultsC!$B$2:$K$51,10,0),\"\")","v":"00:59:32"},{"$f":"IFERROR(VLOOKUP($C17,ResultsC!$B$2:$N$51,13,0),\"\")","v":16},{"$f":"IFERROR(VLOOKUP($C17,ResultsD!$B$2:$I$51,8,0),\"\")","v":"00:56:25"},15,{"$f":"IFERROR(VLOOKUP(C17,ResultsC!$B$2:$J$51,9,0)+VLOOKUP(C17,ResultsB!$B$2:$J$51,9,0),\"\")","v":"00:00:00"},8,14,24,6]
[null,16,{"$f":"IF(ResultsD!B17=\"\",\"\",ResultsD!B17)","v":54},{"$f":"IFERROR(VLOOKUP(C18,Teams!$A$2:$B$51,2,0),\"\")","v":"Keighley & Craven C"},"04:36:23",{"$f":"IFERROR(VLOOKUP(C18,Teams!$A$2:$D$51,4,0),\"\")","v":"Male"},{"$f":"IFERROR(VLOOKUP($C18,ResultsA!$B$2:$K$51,10,0),\"\")","v":"01:20:17"},{"$f":"IFERROR(VLOOKUP($C18,ResultsA!$B$2:$N$52,13,0),\"\")","v":18},{"$f":"IFERROR(VLOOKUP($C18,ResultsB!$B$2:$K$51,10,0),\"\")","v":"01:25:28"},{"$f":"IFERROR(VLOOKUP($C18,ResultsB!$B$2:$N$52,13,0),\"\")","v":18},{"$f":"IFERROR(VLOOKUP($C18,ResultsC!$B$2:$K$51,10,0),\"\")","v":"00:49:40"},{"$f":"IFERROR(VLOOKUP($C18,ResultsC!$B$2:$N$51,13,0),\"\")","v":17},{"$f":"IFERROR(VLOOKUP($C18,ResultsD!$B$2:$I$51,8,0),\"\")","v":"01:00:58"},16,{"$f":"IFERROR(VLOOKUP(C18,ResultsC!$B$2:$J$51,9,0)+VLOOKUP(C18,ResultsB!$B$2:$J$51,9,0),\"\")","v":"00:00:00"},18,16,14,10]
[null,17,{"$f":"IF(ResultsD!B18=\"\",\"\",ResultsD!B18)","v":56},{"$f":"IFERROR(VLOOKUP(C19,Teams!$A$2:$B$51,2,0),\"\")","v":"Bingley Babes"},"04:41:20",{"$f":"IFERROR(VLOOKUP(C19,Teams!$A$2:$D$51,4,0),\"\")","v":"Female"},{"$f":"IFERROR(VLOOKUP($C19,ResultsA!$B$2:$K$51,10,0),\"\")","v":"01:22:00"},{"$f":"IFERROR(VLOOKUP($C19,ResultsA!$B$2:$N$52,13,0),\"\")","v":20},{"$f":"IFERROR(VLOOKUP($C19,ResultsB!$B$2:$K$51,10,0),\"\")","v":"01:29:06"},{"$f":"IFERROR(VLOOKUP($C19,ResultsB!$B$2:$N$52,13,0),\"\")","v":20},{"$f":"IFERROR(VLOOKUP($C19,ResultsC!$B$2:$K$51,10,0),\"\")","v":"00:47:19"},{"$f":"IFERROR(VLOOKUP($C19,ResultsC!$B$2:$N$51,13,0),\"\")","v":18},{"$f":"IFERROR(VLOOKUP($C19,ResultsD!$B$2:$I$51,8,0),\"\")","v":"01:02:55"},17,{"$f":"IFERROR(VLOOKUP(C19,ResultsC!$B$2:$J$51,9,0)+VLOOKUP(C19,ResultsB!$B$2:$J$51,9,0),\"\")","v":"00:00:00"},20,18,10,14]
[null,18,{"$f":"IF(ResultsD!B19=\"\",\"\",ResultsD!B19)","v":41},{"$f":"IFERROR(VLOOKUP(C20,Teams!$A$2:$B$51,2,0),\"\")","v":"Pudsey P Prancers"},"04:42:24",{"$f":"IFERROR(VLOOKUP(C20,Teams!$A$2:$D$51,4,0),\"\")","v":"Male"},{"$f":"IFERROR(VLOOKUP($C20,ResultsA!$B$2:$K$51,10,0),\"\")","v":"01:19:36"},{"$f":"IFERROR(VLOOKUP($C20,ResultsA!$B$2:$N$52,13,0),\"\")","v":17},{"$f":"IFERROR(VLOOKUP($C20,ResultsB!$B$2:$K$51,10,0),\"\")","v":"01:14:57"},{"$f":"IFERROR(VLOOKUP($C20,ResultsB!$B$2:$N$52,13,0),\"\")","v":9},{"$f":"IFERROR(VLOOKUP($C20,ResultsC!$B$2:$K$51,10,0),\"\")","v":"00:50:13"},{"$f":"IFERROR(VLOOKUP($C20,ResultsC!$B$2:$N$51,13,0),\"\")","v":14},{"$f":"IFERROR(VLOOKUP($C20,ResultsD!$B$2:$I$51,8,0),\"\")","v":"01:17:38"},18,{"$f":"IFERROR(VLOOKUP(C20,ResultsC!$B$2:$J$51,9,0)+VLOOKUP(C20,ResultsB!$B$2:$J$51,9,0),\"\")","v":"00:00:00"},17,7,15,26]
[null,19,{"$f":"IF(ResultsD!B20=\"\",\"\",ResultsD!B20)","v":40},{"$f":"IFERROR(VLOOKUP(C21,Teams!$A$2:$B$51,2,0),\"\")","v":"Pudsey P Vixens"},"05:04:38",{"$f":"IFERROR(VLOOKUP(C21,Teams!$A$2:$D$51,4,0),\"\")","v":"Female"},{"$f":"IFERROR(VLOOKUP($C21,ResultsA!$B$2:$K$51,10,0),\"\")","v":"01:12:16"},{"$f":"IFERROR(VLOOKUP($C21,ResultsA!$B$2:$N$52,13,0),\"\")","v":9},{"$f":"IFERROR(VLOOKUP($C21,ResultsB!$B$2:$K$51,10,0),\"\")","v":"01:36:12"},{"$f":"IFERROR(VLOOKUP($C21,ResultsB!$B$2:$N$52,13,0),\"\")","v":19},{"$f":"IFERROR(VLOOKUP($C21,ResultsC!$B$2:$K$51,10,0),\"\")","v":"01:03:14"},{"$f":"IFERROR(VLOOKUP($C21,ResultsC!$B$2:$N$51,13,0),\"\")","v":20},{"$f":"IFERROR(VLOOKUP($C21,ResultsD!$B$2:$I$51,8,0),\"\")","v":"01:12:56"},19,{"$f":"IFERROR(VLOOKUP(C21,ResultsC!$B$2:$J$51,9,0)+VLOOKUP(C21,ResultsB!$B$2:$J$51,9,0),\"\")","v":"00:00:00"},9,20,27,22]
[null,20,{"$f":"IF(ResultsD!B21=\"\",\"\",ResultsD!B21)","v":43},{"$f":"IFERROR(VLOOKUP(C22,Teams!$A$2:$B$51,2,0),\"\")","v":"Pudsey P Dancers"},"05:06:35",{"$f":"IFERROR(VLOOKUP(C22,Teams!$A$2:$D$51,4,0),\"\")","v":"Mixed"},{"$f":"IFERROR(VLOOKUP($C22,ResultsA!$B$2:$K$51,10,0),\"\")","v":"01:28:02"},{"$f":"IFERROR(VLOOKUP($C22,ResultsA!$B$2:$N$52,13,0),\"\")","v":23},{"$f":"IFERROR(VLOOKUP($C22,ResultsB!$B$2:$K$51,10,0),\"\")","v":"01:44:14"},{"$f":"IFERROR(VLOOKUP($C22,ResultsB!$B$2:$N$52,13,0),\"\")","v":24},{"$f":"IFERROR(VLOOKUP($C22,ResultsC!$B$2:$K$51,10,0),\"\")","v":"00:50:29"},{"$f":"IFERROR(VLOOKUP($C22,ResultsC!$B$2:$N$51,13,0),\"\")","v":22},{"$f":"IFERROR(VLOOKUP($C22,ResultsD!$B$2:$I$51,8,0),\"\")","v":"01:01:05"},20,{"$f":"IFERROR(VLOOKUP(C22,ResultsC!$B$2:$J$51,9,0)+VLOOKUP(C22,ResultsB!$B$2:$J$51,9,0),\"\")","v":"00:02:45"},23,23,16,11]
[null,21,{"$f":"IF(ResultsD!B22=\"\",\"\",ResultsD!B22)","v":42},{"$f":"IFERROR(VLOOKUP(C23,Teams!$A$2:$B$51,2,0),\"\")","v":"Pudsey P Comets"},"05:07:32",{"$f":"IFERROR(VLOOKUP(C23,Teams!$A$2:$D$51,4,0),\"\")","v":"Mixed"},{"$f":"IFERROR(VLOOKUP($C23,ResultsA!$B$2:$K$51,10,0),\"\")","v":"01:09:18"},{"$f":"IFERROR(VLOOKUP($C23,ResultsA!$B$2:$N$52,13,0),\"\")","v":4},{"$f":"IFERROR(VLOOKUP($C23,ResultsB!$B$2:$K$51,10,0),\"\")","v":"01:32:19"},{"$f":"IFERROR(VLOOKUP($C23,ResultsB!$B$2:$N$52,13,0),\"\")","v":17},{"$f":"IFERROR(VLOOKUP($C23,ResultsC!$B$2:$K$51,10,0),\"\")","v":"00:58:57"},{"$f":"IFERROR(VLOOKUP($C23,ResultsC!$B$2:$N$51,13,0),\"\")","v":19},{"$f":"IFERROR(VLOOKUP($C23,ResultsD!$B$2:$I$51,8,0),\"\")","v":"01:26:58"},21,{"$f":"IFERROR(VLOOKUP(C23,ResultsC!$B$2:$J$51,9,0)+VLOOKUP(C23,ResultsB!$B$2:$J$51,9,0),\"\")","v":"00:00:00"},4,19,23,28]
[null,22,{"$f":"IF(ResultsD!B23=\"\",\"\",ResultsD!B23)","v":57},{"$f":"IFERROR(VLOOKUP(C24,Teams!$A$2:$B$51,2,0),\"\")","v":"Bingley Belles"},"05:19:48",{"$f":"IFERROR(VLOOKUP(C24,Teams!$A$2:$D$51,4,0),\"\")","v":"Female"},{"$f":"IFERROR(VLOOKUP($C24,ResultsA!$B$2:$K$51,10,0),\"\")","v":"01:19:32"},{"$f":"IFERROR(VLOOKUP($C24,ResultsA!$B$2:$N$52,13,0),\"\")","v":16},{"$f":"IFERROR(VLOOKUP($C24,ResultsB!$B$2:$K$51,10,0),\"\")","v":"01:47:43"},{"$f":"IFERROR(VLOOKUP($C24,ResultsB!$B$2:$N$52,13,0),\"\")","v":22},{"$f":"IFERROR(VLOOKUP($C24,ResultsC!$B$2:$K$51,10,0),\"\")","v":"00:55:15"},{"$f":"IFERROR(VLOOKUP($C24,ResultsC!$B$2:$N$51,13,0),\"\")","v":21},{"$f":"IFERROR(VLOOKUP($C24,ResultsD!$B$2:$I$51,8,0),\"\")","v":"01:14:48"},22,{"$f":"IFERROR(VLOOKUP(C24,ResultsC!$B$2:$J$51,9,0)+VLOOKUP(C24,ResultsB!$B$2:$J$51,9,0),\"\")","v":"00:02:30"},16,25,21,24]
[null,23,{"$f":"IF(ResultsD!B24=\"\",\"\",ResultsD!B24)","v":34},{"$f":"IFERROR(VLOOKUP(C25,Teams!$A$2:$B$51,2,0),\"\")","v":"Cononley"},"05:20:22",{"$f":"IFERROR(VLOOKUP(C25,Teams!$A$2:$D$51,4,0),\"\")","v":"Mixed"},{"$f":"IFERROR(VLOOKUP($C25,ResultsA!$B$2:$K$51,10,0),\"\")","v":"01:21:04"},{"$f":"IFERROR(VLOOKUP($C25,ResultsA!$B$2:$N$52,13,0),\"\")","v":19},{"$f":"IFERROR(VLOOKUP($C25,ResultsB!$B$2:$K$51,10,0),\"\")","v":"01:39:57"},{"$f":"IFERROR(VLOOKUP($C25,ResultsB!$B$2:$N$52,13,0),\"\")","v":21},{"$f":"IFERROR(VLOOKUP($C25,ResultsC!$B$2:$K$51,10,0),\"\")","v":"01:01:54"},{"$f":"IFERROR(VLOOKUP($C25,ResultsC!$B$2:$N$51,13,0),\"\")","v":23},{"$f":"IFERROR(VLOOKUP($C25,ResultsD!$B$2:$I$51,8,0),\"\")","v":"01:14:32"},23,{"$f":"IFERROR(VLOOKUP(C25,ResultsC!$B$2:$J$51,9,0)+VLOOKUP(C25,ResultsB!$B$2:$J$51,9,0),\"\")","v":"00:02:55"},19,22,25,23]
[null,24,{"$f":"IF(ResultsD!B25=\"\",\"\",ResultsD!B25)","v":58},{"$f":"IFERROR(VLOOKUP(C26,Teams!$A$2:$B$51,2,0),\"\")","v":"Hail Marys"},"05:21:10",{"$f":"IFERROR(VLOOKUP(C26,Teams!$A$2:$D$51,4,0),\"\")","v":"Female"},{"$f":"IFERROR(VLOOKUP($C26,ResultsA!$B$2:$K$51,10,0),\"\")","v":"01:29:18"},{"$f":"IFERROR(VLOOKUP($C26,ResultsA!$B$2:$N$52,13,0),\"\")","v":24},{"$f":"IFERROR(VLOOKUP($C26,ResultsB!$B$2:$K$51,10,0),\"\")","v":"01:44:52"},{"$f":"IFERROR(VLOOKUP($C26,ResultsB!$B$2:$N$52,13,0),\"\")","v":25},{"$f":"IFERROR(VLOOKUP($C26,ResultsC!$B$2:$K$51,10,0),\"\")","v":"00:51:26"},{"$f":"IFERROR(VLOOKUP($C26,ResultsC!$B$2:$N$51,13,0),\"\")","v":24},{"$f":"IFERROR(VLOOKUP($C26,ResultsD!$B$2:$I$51,8,0),\"\")","v":"01:09:58"},24,{"$f":"IFERROR(VLOOKUP(C26,ResultsC!$B$2:$J$51,9,0)+VLOOKUP(C26,ResultsB!$B$2:$J$51,9,0),\"\")","v":"00:05:36"},24,24,18,21]
[null,25,{"$f":"IF(ResultsD!B26=\"\",\"\",ResultsD!B26)","v":46},{"$f":"IFERROR(VLOOKUP(C27,Teams!$A$2:$B$51,2,0),\"\")","v":"K & C Mega Munchers"},"05:32:52",{"$f":"IFERROR(VLOOKUP(C27,Teams!$A$2:$D$51,4,0),\"\")","v":"Mixed"},{"$f":"IFERROR(VLOOKUP($C27,ResultsA!$B$2:$K$51,10,0),\"\")","v":"01:31:01"},{"$f":"IFERROR(VLOOKUP($C27,ResultsA!$B$2:$N$52,13,0),\"\")","v":26},{"$f":"IFERROR(VLOOKUP($C27,ResultsB!$B$2:$K$51,10,0),\"\")","v":"01:52:22"},{"$f":"IFERROR(VLOOKUP($C27,ResultsB!$B$2:$N$52,13,0),\"\")","v":27},{"$f":"IFERROR(VLOOKUP($C27,ResultsC!$B$2:$K$51,10,0),\"\")","v":"00:51:18"},{"$f":"IFERROR(VLOOKUP($C27,ResultsC!$B$2:$N$51,13,0),\"\")","v":25},{"$f":"IFERROR(VLOOKUP($C27,ResultsD!$B$2:$I$51,8,0),\"\")","v":"01:03:30"},25,{"$f":"IFERROR(VLOOKUP(C27,ResultsC!$B$2:$J$51,9,0)+VLOOKUP(C27,ResultsB!$B$2:$J$51,9,0),\"\")","v":"00:14:41"},26,26,17,15]
[null,26,{"$f":"IF(ResultsD!B27=\"\",\"\",ResultsD!B27)","v":51},{"$f":"IFERROR(VLOOKUP(C28,Teams!$A$2:$B$51,2,0),\"\")","v":"Barlick 4"},"05:45:59",{"$f":"IFERROR(VLOOKUP(C28,Teams!$A$2:$D$51,4,0),\"\")","v":"Female"},{"$f":"IFERROR(VLOOKUP($C28,ResultsA!$B$2:$K$51,10,0),\"\")","v":"01:32:16"},{"$f":"IFERROR(VLOOKUP($C28,ResultsA!$B$2:$N$52,13,0),\"\")","v":27},{"$f":"IFERROR(VLOOKUP($C28,ResultsB!$B$2:$K$51,10,0),\"\")","v":"01:37:59"},{"$f":"IFERROR(VLOOKUP($C28,ResultsB!$B$2:$N$52,13,0),\"\")","v":23},{"$f":"IFERROR(VLOOKUP($C28,ResultsC!$B$2:$K$51,10,0),\"\")","v":"01:02:29"},{"$f":"IFERROR(VLOOKUP($C28,ResultsC!$B$2:$N$51,13,0),\"\")","v":27},{"$f":"IFERROR(VLOOKUP($C28,ResultsD!$B$2:$I$51,8,0),\"\")","v":"01:20:31"},26,{"$f":"IFERROR(VLOOKUP(C28,ResultsC!$B$2:$J$51,9,0)+VLOOKUP(C28,ResultsB!$B$2:$J$51,9,0),\"\")","v":"00:12:44"},27,21,26,27]
[null,27,{"$f":"IF(ResultsD!B28=\"\",\"\",ResultsD!B28)","v":45},{"$f":"IFERROR(VLOOKUP(C29,Teams!$A$2:$B$51,2,0),\"\")","v":"K & C Bottom Bloomers!!"},"05:47:36",{"$f":"IFERROR(VLOOKUP(C29,Teams!$A$2:$D$51,4,0),\"\")","v":"Female"},{"$f":"IFERROR(VLOOKUP($C29,ResultsA!$B$2:$K$51,10,0),\"\")","v":"01:30:48"},{"$f":"IFERROR(VLOOKUP($C29,ResultsA!$B$2:$N$52,13,0),\"\")","v":25},{"$f":"IFERROR(VLOOKUP($C29,ResultsB!$B$2:$K$51,10,0),\"\")","v":"01:52:34"},{"$f":"IFERROR(VLOOKUP($C29,ResultsB!$B$2:$N$52,13,0),\"\")","v":26},{"$f":"IFERROR(VLOOKUP($C29,ResultsC!$B$2:$K$51,10,0),\"\")","v":"00:56:01"},{"$f":"IFERROR(VLOOKUP($C29,ResultsC!$B$2:$N$51,13,0),\"\")","v":26},{"$f":"IFERROR(VLOOKUP($C29,ResultsD!$B$2:$I$51,8,0),\"\")","v":"01:08:50"},27,{"$f":"IFERROR(VLOOKUP(C29,ResultsC!$B$2:$J$51,9,0)+VLOOKUP(C29,ResultsB!$B$2:$J$51,9,0),\"\")","v":"00:19:23"},25,27,22,19]
[null,28,{"$f":"IF(ResultsD!B29=\"\",\"\",ResultsD!B29)","v":47},{"$f":"IFERROR(VLOOKUP(C30,Teams!$A$2:$B$51,2,0),\"\")","v":"K & C Marvellous Mincers!"},"07:20:05",{"$f":"IFERROR(VLOOKUP(C30,Teams!$A$2:$D$51,4,0),\"\")","v":"Mixed"},{"$f":"IFERROR(VLOOKUP($C30,ResultsA!$B$2:$K$51,10,0),\"\")","v":"01:46:05"},{"$f":"IFERROR(VLOOKUP($C30,ResultsA!$B$2:$N$52,13,0),\"\")","v":28},{"$f":"IFERROR(VLOOKUP($C30,ResultsB!$B$2:$K$51,10,0),\"\")","v":"02:04:18"},{"$f":"IFERROR(VLOOKUP($C30,ResultsB!$B$2:$N$52,13,0),\"\")","v":28},{"$f":"IFERROR(VLOOKUP($C30,ResultsC!$B$2:$K$51,10,0),\"\")","v":"01:12:23"},{"$f":"IFERROR(VLOOKUP($C30,ResultsC!$B$2:$N$51,13,0),\"\")","v":28},{"$f":"IFERROR(VLOOKUP($C30,ResultsD!$B$2:$I$51,8,0),\"\")","v":"01:15:38"},28,{"$f":"IFERROR(VLOOKUP(C30,ResultsC!$B$2:$J$51,9,0)+VLOOKUP(C30,ResultsB!$B$2:$J$51,9,0),\"\")","v":"01:01:41"},28,28,28,25]
[null,29,{"$f":"IF(ResultsD!B30=\"\",\"\",ResultsD!B30)","v":""},{"$f":"IFERROR(VLOOKUP(C31,Teams!$A$2:$B$51,2,0),\"\")","v":""},{"$f":"IFERROR((G31+I31+K31+M31+O31),\"\")","v":""},{"$f":"IFERROR(VLOOKUP(C31,Teams!$A$2:$D$51,4,0),\"\")","v":""},{"$f":"IFERROR(VLOOKUP($C31,ResultsA!$B$2:$K$51,10,0),\"\")","v":""},{"$f":"IFERROR(VLOOKUP($C31,ResultsA!$B$2:$N$52,13,0),\"\")","v":""},{"$f":"IFERROR(VLOOKUP($C31,ResultsB!$B$2:$K$51,10,0),\"\")","v":""},{"$f":"IFERROR(VLOOKUP($C31,ResultsB!$B$2:$N$52,13,0),\"\")","v":""},{"$f":"IFERROR(VLOOKUP($C31,ResultsC!$B$2:$K$51,10,0),\"\")","v":""},{"$f":"IFERROR(VLOOKUP($C31,ResultsC!$B$2:$N$51,13,0),\"\")","v":""},{"$f":"IFERROR(VLOOKUP($C31,ResultsD!$B$2:$I$51,8,0),\"\")","v":""},{"$f":"IF(C31=\"\",\"\",B31)","v":""},{"$f":"IFERROR(VLOOKUP(C31,ResultsC!$B$2:$J$51,9,0)+VLOOKUP(C31,ResultsB!$B$2:$J$51,9,0),\"\")","v":""},{"$f":"H31","v":""},{"$f":"IFERROR(RANK(I31,I$3:I$52,1),\"\")","v":""},{"$f":"IFERROR(RANK(K31,K$3:K$52,1),\"\")","v":""},{"$f":"IFERROR(RANK(M31,M$3:M$52,1),\"\")","v":""}]
[null,30,{"$f":"IF(ResultsD!B31=\"\",\"\",ResultsD!B31)","v":""},{"$f":"IFERROR(VLOOKUP(C32,Teams!$A$2:$B$51,2,0),\"\")","v":""},"",{"$f":"IFERROR(VLOOKUP(C32,Teams!$A$2:$D$51,4,0),\"\")","v":""},{"$f":"IFERROR(VLOOKUP($C32,ResultsA!$B$2:$K$51,10,0),\"\")","v":""},{"$f":"IFERROR(VLOOKUP($C32,ResultsA!$B$2:$N$52,13,0),\"\")","v":""},{"$f":"IFERROR(VLOOKUP($C32,ResultsB!$B$2:$K$51,10,0),\"\")","v":""},{"$f":"IFERROR(VLOOKUP($C32,ResultsB!$B$2:$N$52,13,0),\"\")","v":""},{"$f":"IFERROR(VLOOKUP($C32,ResultsC!$B$2:$K$51,10,0),\"\")","v":""},{"$f":"IFERROR(VLOOKUP($C32,ResultsC!$B$2:$N$51,13,0),\"\")","v":""},{"$f":"IFERROR(VLOOKUP($C32,ResultsD!$B$2:$I$51,8,0),\"\")","v":""},"",{"$f":"IFERROR(VLOOKUP(C32,ResultsC!$B$2:$J$51,9,0)+VLOOKUP(C32,ResultsB!$B$2:$J$51,9,0),\"\")","v":""},"","","",""]
[null,31,{"$f":"IF(ResultsD!B32=\"\",\"\",ResultsD!B32)","v":""},{"$f":"IFERROR(VLOOKUP(C33,Teams!$A$2:$B$51,2,0),\"\")","v":""},"",{"$f":"IFERROR(VLOOKUP(C33,Teams!$A$2:$D$51,4,0),\"\")","v":""},{"$f":"IFERROR(VLOOKUP($C33,ResultsA!$B$2:$K$51,10,0),\"\")","v":""},{"$f":"IFERROR(VLOOKUP($C33,ResultsA!$B$2:$N$52,13,0),\"\")","v":""},{"$f":"IFERROR(VLOOKUP($C33,ResultsB!$B$2:$K$51,10,0),\"\")","v":""},{"$f":"IFERROR(VLOOKUP($C33,ResultsB!$B$2:$N$52,13,0),\"\")","v":""},{"$f":"IFERROR(VLOOKUP($C33,ResultsC!$B$2:$K$51,10,0),\"\")","v":""},{"$f":"IFERROR(VLOOKUP($C33,ResultsC!$B$2:$N$51,13,0),\"\")","v":""},{"$f":"IFERROR(VLOOKUP($C33,ResultsD!$B$2:$I$51,8,0),\"\")","v":""},"",{"$f":"IFERROR(VLOOKUP(C33,ResultsC!$B$2:$J$51,9,0)+VLOOKUP(C33,ResultsB!$B$2:$J$51,9,0),\"\")","v":""},"","","",""]
[null,32,{"$f":"IF(ResultsD!B33=\"\",\"\",ResultsD!B33)","v":""},{"$f":"IFERROR(VLOOKUP(C34,Teams!$A$2:$B$51,2,0),\"\")","v":""},"",{"$f":"IFERROR(VLOOKUP(C34,Teams!$A$2:$D$51,4,0),\"\")","v":""},{"$f":"IFERROR(VLOOKUP($C34,ResultsA!$B$2:$K$51,10,0),\"\")","v":""},{"$f":"IFERROR(VLOOKUP($C34,ResultsA!$B$2:$N$52,13,0),\"\")","v":""},{"$f":"IFERROR(VLOOKUP($C34,ResultsB!$B$2:$K$51,10,0),\"\")","v":""},{"$f":"IFERROR(VLOOKUP($C34,ResultsB!$B$2:$N$52,13,0),\"\")","v":""},{"$f":"IFERROR(VLOOKUP($C34,ResultsC!$B$2:$K$51,10,0),\"\")","v":""},{"$f":"IFERROR(VLOOKUP($C34,ResultsC!$B$2:$N$51,13,0),\"\")","v":""},{"$f":"IFERROR(VLOOKUP($C34,ResultsD!$B$2:$I$51,8,0),\"\")","v":""},"",{"$f":"IFERROR(VLOOKUP(C34,ResultsC!$B$2:$J$51,9,0)+VLOOKUP(C34,ResultsB!$B$2:$J$51,9,0),\"\")","v":""},"","","",""]
[null,33,{"$f":"IF(ResultsD!B34=\"\",\"\",ResultsD!B34)","v":""},{"$f":"IFERROR(VLOOKUP(C35,Teams!$A$2:$B$51,2,0),\"\")","v":""},"",{"$f":"IFERROR(VLOOKUP(C35,Teams!$A$2:$D$51,4,0),\"\")","v":""},{"$f":"IFERROR(VLOOKUP($C35,ResultsA!$B$2:$K$51,10,0),\"\")","v":""},{"$f":"IFERROR(VLOOKUP($C35,ResultsA!$B$2:$N$52,13,0),\"\")","v":""},{"$f":"IFERROR(VLOOKUP($C35,ResultsB!$B$2:$K$51,10,0),\"\")","v":""},{"$f":"IFERROR(VLOOKUP($C35,ResultsB!$B$2:$N$52,13,0),\"\")","v":""},{"$f":"IFERROR(VLOOKUP($C35,ResultsC!$B$2:$K$51,10,0),\"\")","v":""},{"$f":"IFERROR(VLOOKUP($C35,ResultsC!$B$2:$N$51,13,0),\"\")","v":""},{"$f":"IFERROR(VLOOKUP($C35,ResultsD!$B$2:$I$51,8,0),\"\")","v":""},"",{"$f":"IFERROR(VLOOKUP(C35,ResultsC!$B$2:$J$51,9,0)+VLOOKUP(C35,ResultsB!$B$2:$J$51,9,0),\"\")","v":""},"","","",""]
[null,34,{"$f":"IF(ResultsD!B35=\"\",\"\",ResultsD!B35)","v":""},{"$f":"IFERROR(VLOOKUP(C36,Teams!$A$2:$B$51,2,0),\"\")","v":""},"",{"$f":"IFERROR(VLOOKUP(C36,Teams!$A$2:$D$51,4,0),\"\")","v":""},{"$f":"IFERROR(VLOOKUP($C36,ResultsA!$B$2:$K$51,10,0),\"\")","v":""},{"$f":"IFERROR(VLOOKUP($C36,ResultsA!$B$2:$N$52,13,0),\"\")","v":""},{"$f":"IFERROR(VLOOKUP($C36,ResultsB!$B$2:$K$51,10,0),\"\")","v":""},{"$f":"IFERROR(VLOOKUP($C36,ResultsB!$B$2:$N$52,13,0),\"\")","v":""},{"$f":"IFERROR(VLOOKUP($C36,ResultsC!$B$2:$K$51,10,0),\"\")","v":""},{"$f":"IFERROR(VLOOKUP($C36,ResultsC!$B$2:$N$51,13,0),\"\")","v":""},{"$f":"IFERROR(VLOOKUP($C36,ResultsD!$B$2:$I$51,8,0),\"\")","v":""},"",{"$f":"IFERROR(VLOOKUP(C36,ResultsC!$B$2:$J$51,9,0)+VLOOKUP(C36,ResultsB!$B$2:$J$51,9,0),\"\")","v":""},"","","",""]
[null,35,{"$f":"IF(ResultsD!B36=\"\",\"\",ResultsD!B36)","v":""},{"$f":"IFERROR(VLOOKUP(C37,Teams!$A$2:$B$51,2,0),\"\")","v":""},"",{"$f":"IFERROR(VLOOKUP(C37,Teams!$A$2:$D$51,4,0),\"\")","v":""},{"$f":"IFERROR(VLOOKUP($C37,ResultsA!$B$2:$K$51,10,0),\"\")","v":""},{"$f":"IFERROR(VLOOKUP($C37,ResultsA!$B$2:$N$52,13,0),\"\")","v":""},{"$f":"IFERROR(VLOOKUP($C37,ResultsB!$B$2:$K$51,10,0),\"\")","v":""},{"$f":"IFERROR(VLOOKUP($C37,ResultsB!$B$2:$N$52,13,0),\"\")","v":""},{"$f":"IFERROR(VLOOKUP($C37,ResultsC!$B$2:$K$51,10,0),\"\")","v":""},{"$f":"IFERROR(VLOOKUP($C37,ResultsC!$B$2:$N$51,13,0),\"\")","v":""},{"$f":"IFERROR(VLOOKUP($C37,ResultsD!$B$2:$I$51,8,0),\"\")","v":""},"",{"$f":"IFERROR(VLOOKUP(C37,ResultsC!$B$2:$J$51,9,0)+VLOOKUP(C37,ResultsB!$B$2:$J$51,9,0),\"\")","v":""},"","","",""]
[null,36,{"$f":"IF(ResultsD!B37=\"\",\"\",ResultsD!B37)","v":""},{"$f":"IFERROR(VLOOKUP(C38,Teams!$A$2:$B$51,2,0),\"\")","v":""},"",{"$f":"IFERROR(VLOOKUP(C38,Teams!$A$2:$D$51,4,0),\"\")","v":""},{"$f":"IFERROR(VLOOKUP($C38,ResultsA!$B$2:$K$51,10,0),\"\")","v":""},{"$f":"IFERROR(VLOOKUP($C38,ResultsA!$B$2:$N$52,13,0),\"\")","v":""},{"$f":"IFERROR(VLOOKUP($C38,ResultsB!$B$2:$K$51,10,0),\"\")","v":""},{"$f":"IFERROR(VLOOKUP($C38,ResultsB!$B$2:$N$52,13,0),\"\")","v":""},{"$f":"IFERROR(VLOOKUP($C38,ResultsC!$B$2:$K$51,10,0),\"\")","v":""},{"$f":"IFERROR(VLOOKUP($C38,ResultsC!$B$2:$N$51,13,0),\"\")","v":""},{"$f":"IFERROR(VLOOKUP($C38,ResultsD!$B$2:$I$51,8,0),\"\")","v":""},"",{"$f":"IFERROR(VLOOKUP(C38,ResultsC!$B$2:$J$51,9,0)+VLOOKUP(C38,ResultsB!$B$2:$J$51,9,0),\"\")","v":""},"","","",""]
[null,37,{"$f":"IF(ResultsD!B38=\"\",\"\",ResultsD!B38)","v":""},{"$f":"IFERROR(VLOOKUP(C39,Teams!$A$2:$B$51,2,0),\"\")","v":""},"",{"$f":"IFERROR(VLOOKUP(C39,Teams!$A$2:$D$51,4,0),\"\")","v":""},{"$f":"IFERROR(VLOOKUP($C39,ResultsA!$B$2:$K$51,10,0),\"\")","v":""},{"$f":"IFERROR(VLOOKUP($C39,ResultsA!$B$2:$N$52,13,0),\"\")","v":""},{"$f":"IFERROR(VLOOKUP($C39,ResultsB!$B$2:$K$51,10,0),\"\")","v":""},{"$f":"IFERROR(VLOOKUP($C39,ResultsB!$B$2:$N$52,13,0),\"\")","v":""},{"$f":"IFERROR(VLOOKUP($C39,ResultsC!$B$2:$K$51,10,0),\"\")","v":""},{"$f":"IFERROR(VLOOKUP($C39,ResultsC!$B$2:$N$51,13,0),\"\")","v":""},{"$f":"IFERROR(VLOOKUP($C39,ResultsD!$B$2:$I$51,8,0),\"\")","v":""},"",{"$f":"IFERROR(VLOOKUP(C39,ResultsC!$B$2:$J$51,9,0)+VLOOKUP(C39,ResultsB!$B$2:$J$51,9,0),\"\")","v":""},"","","",""]
[null,38,{"$f":"IF(ResultsD!B39=\"\",\"\",ResultsD!B39)","v":""},{"$f":"IFERROR(VLOOKUP(C40,Teams!$A$2:$B$51,2,0),\"\")","v":""},"",{"$f":"IFERROR(VLOOKUP(C40,Teams!$A$2:$D$51,4,0),\"\")","v":""},{"$f":"IFERROR(VLOOKUP($C40,ResultsA!$B$2:$K$51,10,0),\"\")","v":""},{"$f":"IFERROR(VLOOKUP($C40,ResultsA!$B$2:$N$52,13,0),\"\")","v":""},{"$f":"IFERROR(VLOOKUP($C40,ResultsB!$B$2:$K$51,10,0),\"\")","v":""},{"$f":"IFERROR(VLOOKUP($C40,ResultsB!$B$2:$N$52,13,0),\"\")","v":""},{"$f":"IFERROR(VLOOKUP($C40,ResultsC!$B$2:$K$51,10,0),\"\")","v":""},{"$f":"IFERROR(VLOOKUP($C40,ResultsC!$B$2:$N$51,13,0),\"\")","v":""},{"$f":"IFERROR(VLOOKUP($C40,ResultsD!$B$2:$I$51,8,0),\"\")","v":""},"",{"$f":"IFERROR(VLOOKUP(C40,ResultsC!$B$2:$J$51,9,0)+VLOOKUP(C40,ResultsB!$B$2:$J$51,9,0),\"\")","v":""},"","","",""]
[null,39,{"$f":"IF(ResultsD!B40=\"\",\"\",ResultsD!B40)","v":""},{"$f":"IFERROR(VLOOKUP(C41,Teams!$A$2:$B$51,2,0),\"\")","v":""},"",{"$f":"IFERROR(VLOOKUP(C41,Teams!$A$2:$D$51,4,0),\"\")","v":""},{"$f":"IFERROR(VLOOKUP($C41,ResultsA!$B$2:$K$51,10,0),\"\")","v":""},{"$f":"IFERROR(VLOOKUP($C41,ResultsA!$B$2:$N$52,13,0),\"\")","v":""},{"$f":"IFERROR(VLOOKUP($C41,ResultsB!$B$2:$K$51,10,0),\"\")","v":""},{"$f":"IFERROR(VLOOKUP($C41,ResultsB!$B$2:$N$52,13,0),\"\")","v":""},{"$f":"IFERROR(VLOOKUP($C41,ResultsC!$B$2:$K$51,10,0),\"\")","v":""},{"$f":"IFERROR(VLOOKUP($C41,ResultsC!$B$2:$N$51,13,0),\"\")","v":""},{"$f":"IFERROR(VLOOKUP($C41,ResultsD!$B$2:$I$51,8,0),\"\")","v":""},"",{"$f":"IFERROR(VLOOKUP(C41,ResultsC!$B$2:$J$51,9,0)+VLOOKUP(C41,ResultsB!$B$2:$J$51,9,0),\"\")","v":""},"","","",""]
[null,40,{"$f":"IF(ResultsD!B41=\"\",\"\",ResultsD!B41)","v":""},{"$f":"IFERROR(VLOOKUP(C42,Teams!$A$2:$B$51,2,0),\"\")","v":""},"",{"$f":"IFERROR(VLOOKUP(C42,Teams!$A$2:$D$51,4,0),\"\")","v":""},{"$f":"IFERROR(VLOOKUP($C42,ResultsA!$B$2:$K$51,10,0),\"\")","v":""},{"$f":"IFERROR(VLOOKUP($C42,ResultsA!$B$2:$N$52,13,0),\"\")","v":""},{"$f":"IFERROR(VLOOKUP($C42,ResultsB!$B$2:$K$51,10,0),\"\")","v":""},{"$f":"IFERROR(VLOOKUP($C42,ResultsB!$B$2:$N$52,13,0),\"\")","v":""},{"$f":"IFERROR(VLOOKUP($C42,ResultsC!$B$2:$K$51,10,0),\"\")","v":""},{"$f":"IFERROR(VLOOKUP($C42,ResultsC!$B$2:$N$51,13,0),\"\")","v":""},{"$f":"IFERROR(VLOOKUP($C42,ResultsD!$B$2:$I$51,8,0),\"\")","v":""},"",{"$f":"IFERROR(VLOOKUP(C42,ResultsC!$B$2:$J$51,9,0)+VLOOKUP(C42,ResultsB!$B$2:$J$51,9,0),\"\")","v":""},"","","",""]
[null,41,{"$f":"IF(ResultsD!B42=\"\",\"\",ResultsD!B42)","v":""},{"$f":"IFERROR(VLOOKUP(C43,Teams!$A$2:$B$51,2,0),\"\")","v":""},"",{"$f":"IFERROR(VLOOKUP(C43,Teams!$A$2:$D$51,4,0),\"\")","v":""},{"$f":"IFERROR(VLOOKUP($C43,ResultsA!$B$2:$K$51,10,0),\"\")","v":""},{"$f":"IFERROR(VLOOKUP($C43,ResultsA!$B$2:$N$52,13,0),\"\")","v":""},{"$f":"IFERROR(VLOOKUP($C43,ResultsB!$B$2:$K$51,10,0),\"\")","v":""},{"$f":"IFERROR(VLOOKUP($C43,ResultsB!$B$2:$N$52,13,0),\"\")","v":""},{"$f":"IFERROR(VLOOKUP($C43,ResultsC!$B$2:$K$51,10,0),\"\")","v":""},{"$f":"IFERROR(VLOOKUP($C43,ResultsC!$B$2:$N$51,13,0),\"\")","v":""},{"$f":"IFERROR(VLOOKUP($C43,ResultsD!$B$2:$I$51,8,0),\"\")","v":""},"",{"$f":"IFERROR(VLOOKUP(C43,ResultsC!$B$2:$J$51,9,0)+VLOOKUP(C43,ResultsB!$B$2:$J$51,9,0),\"\")","v":""},"","","",""]
[null,42,{"$f":"IF(ResultsD!B43=\"\",\"\",ResultsD!B43)","v":""},{"$f":"IFERROR(VLOOKUP(C44,Teams!$A$2:$B$51,2,0),\"\")","v":""},"",{"$f":"IFERROR(VLOOKUP(C44,Teams!$A$2:$D$51,4,0),\"\")","v":""},{"$f":"IFERROR(VLOOKUP($C44,ResultsA!$B$2:$K$51,10,0),\"\")","v":""},{"$f":"IFERROR(VLOOKUP($C44,ResultsA!$B$2:$N$52,13,0),\"\")","v":""},{"$f":"IFERROR(VLOOKUP($C44,ResultsB!$B$2:$K$51,10,0),\"\")","v":""},{"$f":"IFERROR(VLOOKUP($C44,ResultsB!$B$2:$N$52,13,0),\"\")","v":""},{"$f":"IFERROR(VLOOKUP($C44,ResultsC!$B$2:$K$51,10,0),\"\")","v":""},{"$f":"IFERROR(VLOOKUP($C44,ResultsC!$B$2:$N$51,13,0),\"\")","v":""},{"$f":"IFERROR(VLOOKUP($C44,ResultsD!$B$2:$I$51,8,0),\"\")","v":""},"",{"$f":"IFERROR(VLOOKUP(C44,ResultsC!$B$2:$J$51,9,0)+VLOOKUP(C44,ResultsB!$B$2:$J$51,9,0),\"\")","v":""},"","","",""]
[null,43,{"$f":"IF(ResultsD!B44=\"\",\"\",ResultsD!B44)","v":""},{"$f":"IFERROR(VLOOKUP(C45,Teams!$A$2:$B$51,2,0),\"\")","v":""},"",{"$f":"IFERROR(VLOOKUP(C45,Teams!$A$2:$D$51,4,0),\"\")","v":""},{"$f":"IFERROR(VLOOKUP($C45,ResultsA!$B$2:$K$51,10,0),\"\")","v":""},{"$f":"IFERROR(VLOOKUP($C45,ResultsA!$B$2:$N$52,13,0),\"\")","v":""},{"$f":"IFERROR(VLOOKUP($C45,ResultsB!$B$2:$K$51,10,0),\"\")","v":""},{"$f":"IFERROR(VLOOKUP($C45,ResultsB!$B$2:$N$52,13,0),\"\")","v":""},{"$f":"IFERROR(VLOOKUP($C45,ResultsC!$B$2:$K$51,10,0),\"\")","v":""},{"$f":"IFERROR(VLOOKUP($C45,ResultsC!$B$2:$N$51,13,0),\"\")","v":""},{"$f":"IFERROR(VLOOKUP($C45,ResultsD!$B$2:$I$51,8,0),\"\")","v":""},"",{"$f":"IFERROR(VLOOKUP(C45,ResultsC!$B$2:$J$51,9,0)+VLOOKUP(C45,ResultsB!$B$2:$J$51,9,0),\"\")","v":""},"","","",""]
[null,44,{"$f":"IF(ResultsD!B45=\"\",\"\",ResultsD!B45)","v":""},{"$f":"IFERROR(VLOOKUP(C46,Teams!$A$2:$B$51,2,0),\"\")","v":""},"",{"$f":"IFERROR(VLOOKUP(C46,Teams!$A$2:$D$51,4,0),\"\")","v":""},{"$f":"IFERROR(VLOOKUP($C46,ResultsA!$B$2:$K$51,10,0),\"\")","v":""},{"$f":"IFERROR(VLOOKUP($C46,ResultsA!$B$2:$N$52,13,0),\"\")","v":""},{"$f":"IFERROR(VLOOKUP($C46,ResultsB!$B$2:$K$51,10,0),\"\")","v":""},{"$f":"IFERROR(VLOOKUP($C46,ResultsB!$B$2:$N$52,13,0),\"\")","v":""},{"$f":"IFERROR(VLOOKUP($C46,ResultsC!$B$2:$K$51,10,0),\"\")","v":""},{"$f":"IFERROR(VLOOKUP($C46,ResultsC!$B$2:$N$51,13,0),\"\")","v":""},{"$f":"IFERROR(VLOOKUP($C46,ResultsD!$B$2:$I$51,8,0),\"\")","v":""},"",{"$f":"IFERROR(VLOOKUP(C46,ResultsC!$B$2:$J$51,9,0)+VLOOKUP(C46,ResultsB!$B$2:$J$51,9,0),\"\")","v":""},"","","",""]
[null,45,{"$f":"IF(ResultsD!B46=\"\",\"\",ResultsD!B46)","v":""},{"$f":"IFERROR(VLOOKUP(C47,Teams!$A$2:$B$51,2,0),\"\")","v":""},"",{"$f":"IFERROR(VLOOKUP(C47,Teams!$A$2:$D$51,4,0),\"\")","v":""},{"$f":"IFERROR(VLOOKUP($C47,ResultsA!$B$2:$K$51,10,0),\"\")","v":""},{"$f":"IFERROR(VLOOKUP($C47,ResultsA!$B$2:$N$52,13,0),\"\")","v":""},{"$f":"IFERROR(VLOOKUP($C47,ResultsB!$B$2:$K$51,10,0),\"\")","v":""},{"$f":"IFERROR(VLOOKUP($C47,ResultsB!$B$2:$N$52,13,0),\"\")","v":""},{"$f":"IFERROR(VLOOKUP($C47,ResultsC!$B$2:$K$51,10,0),\"\")","v":""},{"$f":"IFERROR(VLOOKUP($C47,ResultsC!$B$2:$N$51,13,0),\"\")","v":""},{"$f":"IFERROR(VLOOKUP($C47,ResultsD!$B$2:$I$51,8,0),\"\")","v":""},"",{"$f":"IFERROR(VLOOKUP(C47,ResultsC!$B$2:$J$51,9,0)+VLOOKUP(C47,ResultsB!$B$2:$J$51,9,0),\"\")","v":""},"","","",""]
[null,46,{"$f":"IF(ResultsD!B47=\"\",\"\",ResultsD!B47)","v":""},{"$f":"IFERROR(VLOOKUP(C48,Teams!$A$2:$B$51,2,0),\"\")","v":""},"",{"$f":"IFERROR(VLOOKUP(C48,Teams!$A$2:$D$51,4,0),\"\")","v":""},{"$f":"IFERROR(VLOOKUP($C48,ResultsA!$B$2:$K$51,10,0),\"\")","v":""},{"$f":"IFERROR(VLOOKUP($C48,ResultsA!$B$2:$N$52,13,0),\"\")","v":""},{"$f":"IFERROR(VLOOKUP($C48,ResultsB!$B$2:$K$51,10,0),\"\")","v":""},{"$f":"IFERROR(VLOOKUP($C48,ResultsB!$B$2:$N$52,13,0),\"\")","v":""},{"$f":"IFERROR(VLOOKUP($C48,ResultsC!$B$2:$K$51,10,0),\"\")","v":""},{"$f":"IFERROR(VLOOKUP($C48,ResultsC!$B$2:$N$51,13,0),\"\")","v":""},{"$f":"IFERROR(VLOOKUP($C48,ResultsD!$B$2:$I$51,8,0),\"\")","v":""},"",{"$f":"IFERROR(VLOOKUP(C48,ResultsC!$B$2:$J$51,9,0)+VLOOKUP(C48,ResultsB!$B$2:$J$51,9,0),\"\")","v":""},"","","",""]
[null,47,{"$f":"IF(ResultsD!B48=\"\",\"\",ResultsD!B48)","v":""},{"$f":"IFERROR(VLOOKUP(C49,Teams!$A$2:$B$51,2,0),\"\")","v":""},"",{"$f":"IFERROR(VLOOKUP(C49,Teams!$A$2:$D$51,4,0),\"\")","v":""},{"$f":"IFERROR(VLOOKUP($C49,ResultsA!$B$2:$K$51,10,0),\"\")","v":""},{"$f":"IFERROR(VLOOKUP($C49,ResultsA!$B$2:$N$52,13,0),\"\")","v":""},{"$f":"IFERROR(VLOOKUP($C49,ResultsB!$B$2:$K$51,10,0),\"\")","v":""},{"$f":"IFERROR(VLOOKUP($C49,ResultsB!$B$2:$N$52,13,0),\"\")","v":""},{"$f":"IFERROR(VLOOKUP($C49,ResultsC!$B$2:$K$51,10,0),\"\")","v":""},{"$f":"IFERROR(VLOOKUP($C49,ResultsC!$B$2:$N$51,13,0),\"\")","v":""},{"$f":"IFERROR(VLOOKUP($C49,ResultsD!$B$2:$I$51,8,0),\"\")","v":""},"",{"$f":"IFERROR(VLOOKUP(C49,ResultsC!$B$2:$J$51,9,0)+VLOOKUP(C49,ResultsB!$B$2:$J$51,9,0),\"\")","v":""},"","","",""]
[null,48,{"$f":"IF(ResultsD!B49=\"\",\"\",ResultsD!B49)","v":""},{"$f":"IFERROR(VLOOKUP(C50,Teams!$A$2:$B$51,2,0),\"\")","v":""},"",{"$f":"IFERROR(VLOOKUP(C50,Teams!$A$2:$D$51,4,0),\"\")","v":""},{"$f":"IFERROR(VLOOKUP($C50,ResultsA!$B$2:$K$51,10,0),\"\")","v":""},{"$f":"IFERROR(VLOOKUP($C50,ResultsA!$B$2:$N$52,13,0),\"\")","v":""},{"$f":"IFERROR(VLOOKUP($C50,ResultsB!$B$2:$K$51,10,0),\"\")","v":""},{"$f":"IFERROR(VLOOKUP($C50,ResultsB!$B$2:$N$52,13,0),\"\")","v":""},{"$f":"IFERROR(VLOOKUP($C50,ResultsC!$B$2:$K$51,10,0),\"\")","v":""},{"$f":"IFERROR(VLOOKUP($C50,ResultsC!$B$2:$N$51,13,0),\"\")","v":""},{"$f":"IFERROR(VLOOKUP($C50,ResultsD!$B$2:$I$51,8,0),\"\")","v":""},"",{"$f":"IFERROR(VLOOKUP(C50,ResultsC!$B$2:$J$51,9,0)+VLOOKUP(C50,ResultsB!$B$2:$J$51,9,0),\"\")","v":""},"","","",""]
[null,49,{"$f":"IF(ResultsD!B50=\"\",\"\",ResultsD!B50)","v":""},{"$f":"IFERROR(VLOOKUP(C51,Teams!$A$2:$B$51,2,0),\"\")","v":""},"",{"$f":"IFERROR(VLOOKUP(C51,Teams!$A$2:$D$51,4,0),\"\")","v":""},{"$f":"IFERROR(VLOOKUP($C51,ResultsA!$B$2:$K$51,10,0),\"\")","v":""},{"$f":"IFERROR(VLOOKUP($C51,ResultsA!$B$2:$N$52,13,0),\"\")","v":""},{"$f":"IFERROR(VLOOKUP($C51,ResultsB!$B$2:$K$51,10,0),\"\")","v":""},{"$f":"IFERROR(VLOOKUP($C51,ResultsB!$B$2:$N$52,13,0),\"\")","v":""},{"$f":"IFERROR(VLOOKUP($C51,ResultsC!$B$2:$K$51,10,0),\"\")","v":""},{"$f":"IFERROR(VLOOKUP($C51,ResultsC!$B$2:$N$51,13,0),\"\")","v":""},{"$f":"IFERROR(VLOOKUP($C51,ResultsD!$B$2:$I$51,8,0),\"\")","v":""},"",{"$f":"IFERROR(VLOOKUP(C51,ResultsC!$B$2:$J$51,9,0)+VLOOKUP(C51,ResultsB!$B$2:$J$51,9,0),\"\")","v":""},"","","",""]
[null,50,{"$f":"IF(ResultsD!B51=\"\",\"\",ResultsD!B51)","v":""},{"$f":"IFERROR(VLOOKUP(C52,Teams!$A$2:$B$51,2,0),\"\")","v":""},"",{"$f":"IFERROR(VLOOKUP(C52,Teams!$A$2:$D$51,4,0),\"\")","v":""},{"$f":"IFERROR(VLOOKUP($C52,ResultsA!$B$2:$K$51,10,0),\"\")","v":""},{"$f":"IFERROR(VLOOKUP($C52,ResultsA!$B$2:$N$52,13,0),\"\")","v":""},{"$f":"IFERROR(VLOOKUP($C52,ResultsB!$B$2:$K$51,10,0),\"\")","v":""},{"$f":"IFERROR(VLOOKUP($C52,ResultsB!$B$2:$N$52,13,0),\"\")","v":""},{"$f":"IFERROR(VLOOKUP($C52,ResultsC!$B$2:$K$51,10,0),\"\")","v":""},{"$f":"IFERROR(VLOOKUP($C52,ResultsC!$B$2:$N$51,13,0),\"\")","v":""},{"$f":"IFERROR(VLOOKUP($C52,ResultsD!$B$2:$I$51,8,0),\"\")","v":""},"",{"$f":"IFERROR(VLOOKUP(C52,ResultsC!$B$2:$J$51,9,0)+VLOOKUP(C52,ResultsB!$B$2:$J$51,9,0),\"\")","v":""},"","","",""]

{"sheet":"Teams","index":4,"n_rows":101,"n_cols":21,"rows_kept":101,"cut":false,"hidden":true,"merged":[]}
["Team No.","Team Name","Gender","TeamType","TN","Leg1","Name1","Leg2",null,"Leg3",null,"Leg4",null,null,"No","Name","Category","Leg 1","Leg 2","Leg 3","Leg 4"]
[31,"Bingley A Holes",1,{"$f":"IFERROR(VLOOKUP(C2,Gender!$A$2:$B$4,2,0),\"\")","v":"Male"},31,1,"Ian Holmes",2,"Paul Tiffany",3,"Graham Askew",4,"Ged Callan",null,1,"Bingley A Holes","MO","Ian Holmes","Paul Tiffany","Graham Askew","Ged Callan"]
[32,"Bingley B Stards",1,{"$f":"IFERROR(VLOOKUP(C3,Gender!$A$2:$B$4,2,0),\"\")","v":"Male"},31,1,"Andy Jebb",2,"Tom Gomersall",3,"Andy Siddle",4,"Steve Broadbent",null,null,"Dave Stephenson",null,"Andy Jebb","Tom Gomersall","Andy Siddle","Steve Broadbent"]
[33,"Bingley C Rappers",1,{"$f":"IFERROR(VLOOKUP(C4,Gender!$A$2:$B$4,2,0),\"\")","v":"Male"},32,1,"Dave Stephenson",2,"Myles Talbot",3,"James Askew",4,"Andy Gibbons",null,2,"Bingley B Stards","MO","Dave Stephenson","Myles Talbot","James Askew","Andy Gibbons"]
[34,"Cononley",6,{"$f":"IFERROR(VLOOKUP(C5,Gender!$A$2:$B$4,2,0),\"\")","v":"Mixed"},32,1,"Steve Fry",2,"Pete Stephens",3,"Carl Hitchens",4,"Martin Peace",null,null,"Dave Stephenson",null,"Steve Fry","Pete Stephens","Carl Hitchens","Martin Peace"]
[35,"Skipton",6,{"$f":"IFERROR(VLOOKUP(C6,Gender!$A$2:$B$4,2,0),\"\")","v":"Mixed"},33,1,"Mark Westman",2,"Phil Knight",3,"Richard Murray",4,"Adrian Netherwood",null,3,"Bingley C Rappers","MO","Mark Westman","Phil Knight","Richard Murray","Adrian Netherwood"]
[36,"Annie's Dream Team",6,{"$f":"IFERROR(VLOOKUP(C7,Gender!$A$2:$B$4,2,0),\"\")","v":"Mixed"},33,1,"Robbie Williams",2,"Gordon Weight",3,"Carl O’Mara",4,"Josh Netherwood",null,null,"Dave Stephenson",null,"Robbie Williams","Gordon Weight","Carl O’Mara","Josh Netherwood"]
[37,"Doddy Superhero",6,{"$f":"IFERROR(VLOOKUP(C8,Gender!$A$2:$B$4,2,0),\"\")","v":"Mixed"},34,1,"Russ Fairhurst",2,"Andy Kitts",3,"Sue Weeden",4,"Richard Hindle",null,4,"Cononley","O","Russ Fairhurst","Stef Kitts","Sue Weeden","Richard Hindle"]
[38,"Kirkham MX",6,{"$f":"IFERROR(VLOOKUP(C9,Gender!$A$2:$B$4,2,0),\"\")","v":"Mixed"},34,1,"Simon Wheeler",2,"Chris Heaton",3,"Brett Weeden",4,"Steve Slater",null,null,"Russ Fairhurst",null,"Simon Wheeler","Emma Van","Brett Weeden","Steve Slater"]
[39,"St Nicks",6,{"$f":"IFERROR(VLOOKUP(C10,Gender!$A$2:$B$4,2,0),\"\")","v":"Mixed"},35,1,"Nick Oddy",2,"Gav Smith",3,"Julian Hood",4,"Mel Steventon",null,5,"Skipton","XO","Nick Oddy","Gav Smith","Vicky Wilson","Mel Steventon"]
[40,"Pudsey P Vixens",7,{"$f":"IFERROR(VLOOKUP(C11,Gender!$A$2:$B$4,2,0),\"\")","v":"Female"},35,1,"Hilary Seward",2,"Patrick Wardle",3,"Karen Hood",4,"Annmarie Bulcock",null,null,"Mel Steventon",null,"Hilary Seward","Patrick Wardle","Karen Hood","Annmarie Bulcock"]
[41,"Pudsey P Prancers",1,{"$f":"IFERROR(VLOOKUP(C12,Gender!$A$2:$B$4,2,0),\"\")","v":"Male"},36,1,"J Bradshaw",2,"Sam Watson",3,"Anne Milner",4,"Mark Bennett",null,6,"Wharfedale 1"]
[42,"Pudsey P Comets",6,{"$f":"IFERROR(VLOOKUP(C13,Gender!$A$2:$B$4,2,0),\"\")","v":"Mixed"},36,1,"Harry Muir",2,"Ted Mason",3,"Clare McCaleucy",4,"Paul Hindle"]
[43,"Pudsey P Dancers",6,{"$f":"IFERROR(VLOOKUP(C14,Gender!$A$2:$B$4,2,0),\"\")","v":"Mixed"},37,1,"Emma Dodd",2,"Ethnan Hassie",3,"Thod Gibdon",4,"Judy Howells",null,7,"Wharfedale 2"]
[44,"K & C Arsey Amblers",7,{"$f":"IFERROR(VLOOKUP(C15,Gender!$A$2:$B$4,2,0),\"\")","v":"Female"},37,1,"Monica Piddila",2,"Stuart McCaleucy",3,"Steve Milner",4,"Jennifer Battersby"]
[45,"K & C Bottom Bloomers!!",7,{"$f":"IFERROR(VLOOKUP(C16,Gender!$A$2:$B$4,2,0),\"\")","v":"Female"},38,1,"Katherine Kirkham",2,"Dave Kirkham",3,"Sarah Charlsworth",4,"Paul Wilson",null,8,"Wharfedale 3"]
[46,"K & C Mega Munchers",6,{"$f":"IFERROR(VLOOKUP(C17,Gender!$A$2:$B$4,2,0),\"\")","v":"Mixed"},38,1,"Katie Wherthby",2,"Dave Papilla",3,"Louise Pickles",4,"Simon Hassle"]
[47,"K & C Marvellous Mincers!",6,{"$f":"IFERROR(VLOOKUP(C18,Gender!$A$2:$B$4,2,0),\"\")","v":"Mixed"},39,1,"Jason Hemsley",2,"Spencer Riley",3,"Bridget Thompson",4,"Graham Bird",null,9,"Wharfedale 4"]
[48,"Rudolf Needs A Vet",6,{"$f":"IFERROR(VLOOKUP(C19,Gender!$A$2:$B$4,2,0),\"\")","v":"Mixed"},39,1,"Marc Sennett",2,"Nick Charsworth",3,"Geoff Thompson",4,"Chris Tones"]
[49,"Real Men Wear Pink",6,{"$f":"IFERROR(VLOOKUP(C20,Gender!$A$2:$B$4,2,0),\"\")","v":"Mixed"},40,1,"Michelle Tenwick",2,"Caroline Clarke",3,"Lynn Arthurs",4,"Emma Robinson",null,10,"Pudsey P Vixens","FO","Michelle Tenwick","Caroline Clarke","Lynn Arthurs","Emma Robinson"]
[50,"Barlick 3 Belles",7,{"$f":"IFERROR(VLOOKUP(C21,Gender!$A$2:$B$4,2,0),\"\")","v":"Female"},40,1,"Karen Pickles",2,"Diane Wood",3,"Lisa Jamieson",4,"Amy Smith",null,null,"Caroline Clarke",null,"Karen Pickles","Diane Wood","Lisa Jamieson","Amy Smith"]
[51,"Barlick 4",7,{"$f":"IFERROR(VLOOKUP(C22,Gender!$A$2:$B$4,2,0),\"\")","v":"Female"},41,1,"Dave Burdon",2,"Rob Samuels",3,"Mark Pawson",4,"Nick Greenwood",null,11,"Pudsey P Prancers","MO","Tony Mawson","Rob Samuels","Steve Pattison","Nick Greenwood"]
[52,"Keighley & Craven A ",1,{"$f":"IFERROR(VLOOKUP(C23,Gender!$A$2:$B$4,2,0),\"\")","v":"Male"},41,1,"Steve Pattison",2,"Ollie Roberts",3,"Brad Strutt",4,"John Popiolek",null,null,"Tony Mawson",null,"Mark Pawson","Ollie Roberts","Brad Strutt","John Popiolek"]
[53,"Keighley & Craven B",1,{"$f":"IFERROR(VLOOKUP(C24,Gender!$A$2:$B$4,2,0),\"\")","v":"Male"},42,1,"Gary Bailey",2,"William Overton",3,"Lynne Barrett",4,"Clare Greenwood",null,12,"Pudsey P Comets","XO","Dave Burdon","William Overton","Lynne Barrett","Clare Greenwood"]
[54,"Keighley & Craven C",1,{"$f":"IFERROR(VLOOKUP(C25,Gender!$A$2:$B$4,2,0),\"\")","v":"Male"},42,1,"Adam Graves",2,"Martin Bullock",3,"Pam Birchenall",4,"Rebecca Dickinson",null,null,"William Overton",null,"Adam Graves","Martin Bullock/Andrew Brownell-Judd","Pam Birchenall","Rebecca Dickinson"]
[55,"Bingley Angels",7,{"$f":"IFERROR(VLOOKUP(C26,Gender!$A$2:$B$4,2,0),\"\")","v":"Female"},43,1,"Andy Norman",2,"Jenny Cooper",3,"Steve Boom",4,"Paula Bradshaw",null,13,"Pudsey P Dancers","XO","Andy Norman","Jenny Cooper","Steve Boom","Paula bradshaw"]
[56,"Bingley Babes",7,{"$f":"IFERROR(VLOOKUP(C27,Gender!$A$2:$B$4,2,0),\"\")","v":"Female"},43,1,"Sarah Norman",2,"Dave Cooper",3,"Sharon Hague",4,"Neil Wallace",null,null,"Andy Norman",null,"Sarah Norman","Dave cooper","Sharon Hague","Neil Wallace"]
[57,"Bingley Belles",7,{"$f":"IFERROR(VLOOKUP(C28,Gender!$A$2:$B$4,2,0),\"\")","v":"Female"},44,1,"Sue Straw",2,"Tizz Woffenden",3,"Ayan Hardacker",4,"Sharon Hudson",null,14,"K & C Arsey Amblers","FO","Sue Straw","Tizz Woffenden","Ayan Hardacker","Sharon Hudson"]
[58,"Hail Marys",7,{"$f":"IFERROR(VLOOKUP(C29,Gender!$A$2:$B$4,2,0),\"\")","v":"Female"},44,1,"Amanda Sterling",2,"Claire Cooper",3,"Camille Askins",4,"Hilary Barber",null,null,"Tizz",null,"Amanda Sterling","Claire Cooper","Camille Askins","Hilary Barber"]
[59,null,null,{"$f":"IFERROR(VLOOKUP(C30,Gender!$A$2:$B$4,2,0),\"\")","v":""},45,1,"Emma Dooks",2,"Dianne MacDonald",3,"Tracey Hodgson",4,"Gill Petrucci",null,15,"K & C Bottom Bloomers!!","FO","Emma Dooks","Dianne MacDonald","Tracey Hodgson","Gill Petrucci"]
[".",null,null,{"$f":"IFERROR(VLOOKUP(C31,Gender!$A$2:$B$4,2,0),\"\")","v":""},45,1,"Rachel Lyles",2,"Tina Kelly",3,"Luisa Lauren",4,"Jo Lewis",null,null,"Tizz",null,"Rachel Lyles","Tina Kelly","Luisa Lauren","Jo Lewis"]
[61,null,null,{"$f":"IFERROR(VLOOKUP(C32,Gender!$A$2:$B$4,2,0),\"\")","v":""},46,1,"Tim Thom",2,"Anand Ravel",3,"Victoria Wadsworth",4,"Richard Taylor",null,16,"K & C Mega Munchers","XO","Tim Thom","Anand Ravel","Victoria Wadsworth","Richard Taylor"]
[62,null,null,{"$f":"IFERROR(VLOOKUP(C33,Gender!$A$2:$B$4,2,0),\"\")","v":""},46,1,"Kayleigh Fish",2,"Alan Kirton",3,"Trish Gavins",4,"Hannah Yates",null,null,"Tizz",null,"Kayleigh Fish","Alan Kirton","Trish Gavins","Hannah Yates"]
[63,null,null,{"$f":"IFERROR(VLOOKUP(C34,Gender!$A$2:$B$4,2,0),\"\")","v":""},47,1,"Arthur Leng",2,"Jane Sedgwick",3,"Jackie Kirton",4,"Simon Chester",null,17,"K & C Marvellous Mincers!","XO","Arthur Leng","Jane Sedgwick","Jackie Kirton","Simon Chester"]
[64,null,null,{"$f":"IFERROR(VLOOKUP(C35,Gender!$A$2:$B$4,2,0),\"\")","v":""},47,1,"Gary Searby",2,"Heather Crow",3,"Katy Stabler",4,"Iain Rodgers",null,null,"Tizz",null,"Gary Searby","Heather Crow","Katy Stabler","Carl Jenkinson"]
[65,null,null,{"$f":"IFERROR(VLOOKUP(C36,Gender!$A$2:$B$4,2,0),\"\")","v":""},48,1,"Paul Elcock",2,"Gary Bradley",3,"Gary Shaw",4,"Carl Pawson",null,18,"Barlick 1","MV","Paul Elcock","Gary Bradley","Gary Shaw","Carl Pawson"]
[66,null,null,{"$f":"IFERROR(VLOOKUP(C37,Gender!$A$2:$B$4,2,0),\"\")","v":""},48,1,"David Halliday",2,"John Boothman",3,"Chris Smale",4,"Virgil Barton",null,null,"Andy Berry",null,"David Halliday","John Boothman","Chris Smale","Virgil Barton"]
[67,null,null,{"$f":"IFERROR(VLOOKUP(C38,Gender!$A$2:$B$4,2,0),\"\")","v":""},49,1,"Lee Edwards",2,"Nick Kendal",3,"Scott Boardman",4,"Andy Berry",null,19,"Barlick 2","MO","Lee Edwards","Nick Kendal","Scott Boardman","Andy Berry"]
[68,null,null,{"$f":"IFERROR(VLOOKUP(C39,Gender!$A$2:$B$4,2,0),\"\")","v":""},49,1,"Andy Collins",2,"Pete Beresford",3,"Scott McCredle",4,"Tim Piggott",null,null,"Andy Berry",null,"Andy Collins","Pete Beresford","Scott McCredle","Tim Piggott"]
[39,null,null,{"$f":"IFERROR(VLOOKUP(C40,Gender!$A$2:$B$4,2,0),\"\")","v":""},50,1,"Angela Donlon",2,"Sarah Tipler",3,"Rachel Villiers",4,"Leanne Dinsdale",null,20,"Barlick 3"]
[40,null,null,{"$f":"IFERROR(VLOOKUP(C41,Gender!$A$2:$B$4,2,0),\"\")","v":""},50,1,"Jenifer Hird",2,"Lorraine Slater",3,"Amma Bailey",4,"Rachel Lowther"]
[41,null,null,{"$f":"IFERROR(VLOOKUP(C42,Gender!$A$2:$B$4,2,0),\"\")","v":""},51,1,"Hannah Newbold",2,"Rachel Eyles",3,"Jenna Boothman",4,"Natalie Edwards",null,21,"Barlick 4"]
[42,null,null,{"$f":"IFERROR(VLOOKUP(C43,Gender!$A$2:$B$4,2,0),\"\")","v":""},51,1,"Hannah Watson",2,"Karen Naylor",3,"Donna Milligan",4,"Katie Towers"]
[43,null,null,{"$f":"IFERROR(VLOOKUP(C44,Gender!$A$2:$B$4,2,0),\"\")","v":""},52,1,"Craig Shearer",2,"Chris Loftus",3,"Alfie Wailker",4,"JP Hopskinson"]
[44,null,null,{"$f":"IFERROR(VLOOKUP(C45,Gender!$A$2:$B$4,2,0),\"\")","v":""},52,1,"Shaun Wilkinson",2,"Ian Willis",3,"Paul Crabtree",4,"Robert Thompson"]
[45,null,null,{"$f":"IFERROR(VLOOKUP(C46,Gender!$A$2:$B$4,2,0),\"\")","v":""},53,1,"Simon Bellwood",2,"Richard Butter",3,"Tim Clegg",4,"Craig Cooper"]
[46,null,null,{"$f":"IFERROR(VLOOKUP(C47,Gender!$A$2:$B$4,2,0),\"\")","v":""},53,1,"Dave Copping",2,"Dick Ballentine",3,"Ian Willis",4,"Tony Booth"]
[47,null,null,{"$f":"IFERROR(VLOOKUP(C48,Gender!$A$2:$B$4,2,0),\"\")","v":""},54,1,"Jeremy Wilkinson",2,"Alan Wright",3,"Jim Roberts",4,"Stuart Preston"]
[48,null,null,{"$f":"IFERROR(VLOOKUP(C49,Gender!$A$2:$B$4,2,0),\"\")","v":""},54,1,"Nick Dewell",2,"Gary Ward",3,"Pete Lloyd",4,"Vic Bamfield"]
[49,null,null,{"$f":"IFERROR(VLOOKUP(C50,Gender!$A$2:$B$4,2,0),\"\")","v":""},55,1,"Lesley Watson",2,"Ruth Whitehead",3,"Eliza Findley",4,"Ellie Kitchen"]
[50,null,null,{"$f":"IFERROR(VLOOKUP(C51,Gender!$A$2:$B$4,2,0),\"\")","v":""},55,1,"Mary Green",2,"Jo Buckley",3,"Katie Smith",4,"Shona Stone"]
[null,null,null,null,56,1,"Sue Becconsall",2,"Kate Farley",3,"Sarah Flaherty",4,"Julie Thornton"]
[null,null,null,null,56,1,"Alison Dewhirst",2,"Sarah Dewhirst",3,"Becky Weight",4,"Marisol Carrera"]
[null,null,null,null,57,1,"Denise Wright",2,"Sue Fulton",3,"Joanne Henry",4,"Meryl Levington"]
[null,null,null,null,57,1,"Stephanine Robson",2,"Eleanor Brown",3,"Rachael Sharples",4,"Alison Marks"]
[null,null,null,null,58,1,"Donna Chester",2,"Angela Paxton",3,"Amanda Harrison",4,"Claire Smurthwaite"]
[null,null,null,null,58,1,"Diane Whiteoak",2,"Joanne Griffiths",3,"Liz Crossland",4,"Catherine Mercer"]
[null,null,null,null,null,1,null,2,null,3,null,4]
[null,null,null,null,null,1,null,2,null,3,null,4]
[null,null,null,null,null,1,null,2,null,3,null,4]
[null,null,null,null,null,1,null,2,null,3,null,4]
[null,null,null,null,null,1,null,2,null,3,null,4]
[null,null,null,null,null,1,null,2,null,3,null,4]
[null,null,null,null,null,1,null,2,null,3,null,4]
[null,null,null,null,null,1,null,2,null,3,null,4]
[null,null,null,null,null,1,null,2,null,3,null,4]
[null,null,null,null,null,1,null,2,null,3,null,4]
[null,null,null,null,null,1,null,2,null,3,null,4]
[null,null,null,null,null,1,null,2,null,3,null,4]
[null,null,null,null,null,1,null,2,null,3,null,4]
[null,null,null,null,null,1,null,2,null,3,null,4]
[null,null,null,null,null,1,null,2,null,3,null,4]
[null,null,null,null,null,1,null,2,null,3,null,4]
[null,null,null,null,null,1,null,2,null,3,null,4]
[null,null,null,null,null,1,null,2,null,3,null,4]
[null,null,null,null,null,1,null,2,null,3,null,4]
[null,null,null,null,null,1,null,2,null,3,null,4]
[null,null,null,null,null,1,null,2,null,3,null,4]
[null,null,null,null,null,1,null,2,null,3,null,4]
[null,null,null,null,null,1,null,2,null,3,null,4]
[null,null,null,null,null,1,null,2,null,3,null,4]
[null,null,null,null,null,1,null,2,null,3,null,4]
[null,null,null,null,null,1,null,2,null,3,null,4]
[null,null,null,null,null,1,null,2,null,3,null,4]
[null,null,null,null,null,1,null,2,null,3,null,4]
[null,null,null,null,null,1,null,2,null,3,null,4]
[null,null,null,null,null,1,null,2,null,3,null,4]
[null,null,null,null,null,1,null,2,null,3,null,4]
[null,null,null,null,null,1,null,2,null,3,null,4]
[null,null,null,null,null,1,null,2,null,3,null,4]
[null,null,null,null,null,1,null,2,null,3,null,4]
[null,null,null,null,null,1,null,2,null,3,null,4]
[null,null,null,null,null,1,null,2,null,3,null,4]
[null,null,null,null,null,1,null,2,null,3,null,4]
[null,null,null,null,null,1,null,2,null,3,null,4]
[null,null,null,null,null,1,null,2,null,3,null,4]
[null,null,null,null,null,1,null,2,null,3,null,4]
[null,null,null,null,null,1,null,2,null,3,null,4]
[null,null,null,null,null,1,null,2,null,3,null,4]
[null,null,null,null,null,1,null,2,null,3,null,4]
[null,null,null,null,null,1,null,2,null,3,null,4]

{"sheet":"Gender","index":5,"n_rows":4,"n_cols":5,"rows_kept":4,"cut":false,"hidden":true,"merged":[]}
["LookUp","Team","Start","MST1","Leg2"]
[1,"Male",27]
[6,"Mixed"]
[7,"Female"]

{"sheet":"ResultsA","index":6,"n_rows":51,"n_cols":15,"rows_kept":51,"cut":false,"hidden":true,"merged":[]}
["Position","Number","hours","mins","secs","Cuml Time","Club","M/F/X","MST Cuml1","Over MST","ALT1","ACT1","SOT1","LFP1","01:45:00"]
[1,31,1,0,17,{"$f":"IF(B2=\"\",\"\",TIME(C2,D2,E2))","v":"01:00:17"},{"$f":"IF($B2=\"\",\"\",(VLOOKUP($B2,Teams!$A$2:$C$51,2,FALSE)))","v":"Bingley A Holes"},{"$f":"IF($B2=\"\",\"\",(VLOOKUP($B2,Teams!$A$2:$D$51,4,FALSE)))","v":"Male"},{"$f":"IF(B2=\"\",\"\",$O$1)","v":"01:45:00"},{"$f":"IF(F2=\"\",\"\",IF((F2-I2)>0,F2-I2,0))","v":"00:00:00"},{"$f":"F2","v":"01:00:17"},{"$f":"F2","v":"01:00:17"},{"$f":"IF(F2<I2,F2,I2)","v":"01:00:17"},{"$f":"IF(B2=\"\",\"\",A2)","v":1}]
[2,49,1,3,57,"01:03:57",{"$f":"IF($B3=\"\",\"\",(VLOOKUP($B3,Teams!$A$2:$C$41,2,FALSE)))","v":"Real Men Wear Pink"},{"$f":"IF($B3=\"\",\"\",(VLOOKUP($B3,Teams!$A$2:$D$51,4,FALSE)))","v":"Mixed"},"01:45:00","00:00:00","01:03:57","01:03:57","01:03:57",{"$f":"IF(B3=\"\",\"\",A3)","v":2}]
[3,36,1,4,12,"01:04:12",{"$f":"IF($B4=\"\",\"\",(VLOOKUP($B4,Teams!$A$2:$C$41,2,FALSE)))","v":"Annie's Dream Team"},{"$f":"IF($B4=\"\",\"\",(VLOOKUP($B4,Teams!$A$2:$D$51,4,FALSE)))","v":"Mixed"},"01:45:00","00:00:00","01:04:12","01:04:12","01:04:12",3]
[4,42,1,9,18,"01:09:18",{"$f":"IF($B5=\"\",\"\",(VLOOKUP($B5,Teams!$A$2:$C$41,2,FALSE)))","v":"Pudsey P Comets"},{"$f":"IF($B5=\"\",\"\",(VLOOKUP($B5,Teams!$A$2:$D$51,4,FALSE)))","v":"Mixed"},"01:45:00","00:00:00","01:09:18","01:09:18","01:09:18",4]
[5,52,1,9,34,"01:09:34",{"$f":"IF($B6=\"\",\"\",(VLOOKUP($B6,Teams!$A$2:$C$41,2,FALSE)))","v":"Keighley & Craven A "},{"$f":"IF($B6=\"\",\"\",(VLOOKUP($B6,Teams!$A$2:$D$51,4,FALSE)))","v":"Male"},"01:45:00","00:00:00","01:09:34","01:09:34","01:09:34",5]
[6,39,1,10,7,"01:10:07",{"$f":"IF($B7=\"\",\"\",(VLOOKUP($B7,Teams!$A$2:$C$41,2,FALSE)))","v":"St Nicks"},{"$f":"IF($B7=\"\",\"\",(VLOOKUP($B7,Teams!$A$2:$D$51,4,FALSE)))","v":"Mixed"},"01:45:00","00:00:00","01:10:07","01:10:07","01:10:07",6]
[7,32,1,10,27,"01:10:27",{"$f":"IF($B8=\"\",\"\",(VLOOKUP($B8,Teams!$A$2:$C$41,2,FALSE)))","v":"Bingley B Stards"},{"$f":"IF($B8=\"\",\"\",(VLOOKUP($B8,Teams!$A$2:$D$51,4,FALSE)))","v":"Male"},"01:45:00","00:00:00","01:10:27","01:10:27","01:10:27",7]
[8,33,1,11,10,"01:11:10",{"$f":"IF($B9=\"\",\"\",(VLOOKUP($B9,Teams!$A$2:$C$41,2,FALSE)))","v":"Bingley C Rappers"},{"$f":"IF($B9=\"\",\"\",(VLOOKUP($B9,Teams!$A$2:$D$51,4,FALSE)))","v":"Male"},"01:45:00","00:00:00","01:11:10","01:11:10","01:11:10",8]
[9,40,1,12,16,"01:12:16",{"$f":"IF($B10=\"\",\"\",(VLOOKUP($B10,Teams!$A$2:$C$41,2,FALSE)))","v":"Pudsey P Vixens"},{"$f":"IF($B10=\"\",\"\",(VLOOKUP($B10,Teams!$A$2:$D$51,4,FALSE)))","v":"Female"},"01:45:00","00:00:00","01:12:16","01:12:16","01:12:16",9]
[10,50,1,12,50,"01:12:50",{"$f":"IF($B11=\"\",\"\",(VLOOKUP($B11,Teams!$A$2:$C$41,2,FALSE)))","v":"Barlick 3 Belles"},{"$f":"IF($B11=\"\",\"\",(VLOOKUP($B11,Teams!$A$2:$D$51,4,FALSE)))","v":"Female"},"01:45:00","00:00:00","01:12:50","01:12:50","01:12:50",10]
[11,37,1,13,32,{"$f":"IF(B12=\"\",\"\",TIME(C12,D12,E12))","v":"01:13:32"},{"$f":"IF($B12=\"\",\"\",(VLOOKUP($B12,Teams!$A$2:$C$41,2,FALSE)))","v":"Doddy Superhero"},{"$f":"IF($B12=\"\",\"\",(VLOOKUP($B12,Teams!$A$2:$D$51,4,FALSE)))","v":"Mixed"},"01:45:00","00:00:00","01:13:32","01:13:32","01:13:32",11]
[12,53,1,14,11,"01:14:11",{"$f":"IF($B13=\"\",\"\",(VLOOKUP($B13,Teams!$A$2:$C$41,2,FALSE)))","v":"Keighley & Craven B"},{"$f":"IF($B13=\"\",\"\",(VLOOKUP($B13,Teams!$A$2:$D$51,4,FALSE)))","v":"Male"},"01:45:00","00:00:00","01:14:11","01:14:11","01:14:11",12]
[13,48,1,18,12,"01:18:12",{"$f":"IF($B14=\"\",\"\",(VLOOKUP($B14,Teams!$A$2:$C$41,2,FALSE)))","v":"Rudolf Needs A Vet"},{"$f":"IF($B14=\"\",\"\",(VLOOKUP($B14,Teams!$A$2:$D$51,4,FALSE)))","v":"Mixed"},"01:45:00","00:00:00","01:18:12","01:18:12","01:18:12",13]
[14,55,1,18,52,"01:18:52",{"$f":"IF($B15=\"\",\"\",(VLOOKUP($B15,Teams!$A$2:$C$41,2,FALSE)))","v":"Bingley Angels"},{"$f":"IF($B15=\"\",\"\",(VLOOKUP($B15,Teams!$A$2:$D$51,4,FALSE)))","v":"Female"},"01:45:00","00:00:00","01:18:52","01:18:52","01:18:52",14]
[15,44,1,19,22,"01:19:22",{"$f":"IF($B16=\"\",\"\",(VLOOKUP($B16,Teams!$A$2:$C$41,2,FALSE)))","v":"K & C Arsey Amblers"},{"$f":"IF($B16=\"\",\"\",(VLOOKUP($B16,Teams!$A$2:$D$51,4,FALSE)))","v":"Female"},"01:45:00","00:00:00","01:19:22","01:19:22","01:19:22",15]
[16,57,1,19,32,"01:19:32",{"$f":"IF($B17=\"\",\"\",(VLOOKUP($B17,Teams!$A$2:$C$41,2,FALSE)))","v":"Bingley Belles"},{"$f":"IF($B17=\"\",\"\",(VLOOKUP($B17,Teams!$A$2:$D$51,4,FALSE)))","v":"Female"},"01:45:00","00:00:00","01:19:32","01:19:32","01:19:32",16]
[17,41,1,19,36,"01:19:36",{"$f":"IF($B18=\"\",\"\",(VLOOKUP($B18,Teams!$A$2:$C$41,2,FALSE)))","v":"Pudsey P Prancers"},{"$f":"IF($B18=\"\",\"\",(VLOOKUP($B18,Teams!$A$2:$D$51,4,FALSE)))","v":"Male"},"01:45:00","00:00:00","01:19:36","01:19:36","01:19:36",17]
[18,54,1,20,17,"01:20:17",{"$f":"IF($B19=\"\",\"\",(VLOOKUP($B19,Teams!$A$2:$C$41,2,FALSE)))","v":"Keighley & Craven C"},{"$f":"IF($B19=\"\",\"\",(VLOOKUP($B19,Teams!$A$2:$D$51,4,FALSE)))","v":"Male"},"01:45:00","00:00:00","01:20:17","01:20:17","01:20:17",18]
[19,34,1,21,4,"01:21:04",{"$f":"IF($B20=\"\",\"\",(VLOOKUP($B20,Teams!$A$2:$C$41,2,FALSE)))","v":"Cononley"},{"$f":"IF($B20=\"\",\"\",(VLOOKUP($B20,Teams!$A$2:$D$51,4,FALSE)))","v":"Mixed"},"01:45:00","00:00:00","01:21:04","01:21:04","01:21:04",19]
[20,56,1,22,0,"01:22:00",{"$f":"IF($B21=\"\",\"\",(VLOOKUP($B21,Teams!$A$2:$C$41,2,FALSE)))","v":"Bingley Babes"},{"$f":"IF($B21=\"\",\"\",(VLOOKUP($B21,Teams!$A$2:$D$51,4,FALSE)))","v":"Female"},"01:45:00","00:00:00","01:22:00","01:22:00","01:22:00",20]
[21,35,1,22,7,"01:22:07",{"$f":"IF($B22=\"\",\"\",(VLOOKUP($B22,Teams!$A$2:$C$41,2,FALSE)))","v":"Skipton"},{"$f":"IF($B22=\"\",\"\",(VLOOKUP($B22,Teams!$A$2:$D$51,4,FALSE)))","v":"Mixed"},"01:45:00","00:00:00","01:22:07","01:22:07","01:22:07",21]
[22,38,1,26,27,"01:26:27",{"$f":"IF($B23=\"\",\"\",(VLOOKUP($B23,Teams!$A$2:$C$41,2,FALSE)))","v":"Kirkham MX"},{"$f":"IF($B23=\"\",\"\",(VLOOKUP($B23,Teams!$A$2:$D$51,4,FALSE)))","v":"Mixed"},"01:45:00","00:00:00","01:26:27","01:26:27","01:26:27",22]
[23,43,1,28,2,"01:28:02",{"$f":"IF($B24=\"\",\"\",(VLOOKUP($B24,Teams!$A$2:$C$41,2,FALSE)))","v":"Pudsey P Dancers"},{"$f":"IF($B24=\"\",\"\",(VLOOKUP($B24,Teams!$A$2:$D$51,4,FALSE)))","v":"Mixed"},"01:45:00","00:00:00","01:28:02","01:28:02","01:28:02",23]
[24,58,1,29,18,"01:29:18",{"$f":"IF($B25=\"\",\"\",(VLOOKUP($B25,Teams!$A$2:$C$41,2,FALSE)))","v":"Hail Marys"},{"$f":"IF($B25=\"\",\"\",(VLOOKUP($B25,Teams!$A$2:$D$51,4,FALSE)))","v":"Female"},"01:45:00","00:00:00","01:29:18","01:29:18","01:29:18",24]
[25,45,1,30,48,"01:30:48",{"$f":"IF($B26=\"\",\"\",(VLOOKUP($B26,Teams!$A$2:$C$41,2,FALSE)))","v":"K & C Bottom Bloomers!!"},{"$f":"IF($B26=\"\",\"\",(VLOOKUP($B26,Teams!$A$2:$D$51,4,FALSE)))","v":"Female"},"01:45:00","00:00:00","01:30:48","01:30:48","01:30:48",25]
[26,46,1,31,1,"01:31:01",{"$f":"IF($B27=\"\",\"\",(VLOOKUP($B27,Teams!$A$2:$C$41,2,FALSE)))","v":"K & C Mega Munchers"},{"$f":"IF($B27=\"\",\"\",(VLOOKUP($B27,Teams!$A$2:$D$51,4,FALSE)))","v":"Mixed"},"01:45:00","00:00:00",{"$f":"F27","v":"01:31:01"},{"$f":"IF(F27<I27,F27,I27)","v":"01:31:01"},"01:31:01",26]
[27,51,1,32,16,"01:32:16",{"$f":"IF($B28=\"\",\"\",(VLOOKUP($B28,Teams!$A$2:$C$41,2,FALSE)))","v":"Barlick 4"},{"$f":"IF($B28=\"\",\"\",(VLOOKUP($B28,Teams!$A$2:$D$51,4,FALSE)))","v":"Female"},"01:45:00","00:00:00",{"$f":"F28","v":"01:32:16"},{"$f":"IF(F28<I28,F28,I28)","v":"01:32:16"},"01:32:16",27]
[28,47,1,46,5,{"$f":"IF(B29=\"\",\"\",TIME(C29,D29,E29))","v":"01:46:05"},{"$f":"IF($B29=\"\",\"\",(VLOOKUP($B29,Teams!$A$2:$C$41,2,FALSE)))","v":"K & C Marvellous Mincers!"},{"$f":"IF($B29=\"\",\"\",(VLOOKUP($B29,Teams!$A$2:$D$51,4,FALSE)))","v":"Mixed"},{"$f":"IF(B29=\"\",\"\",$O$1)","v":"01:45:00"},{"$f":"IF(F29=\"\",\"\",IF((F29-I29)>0,F29-I29,0))","v":"00:01:05"},{"$f":"F29","v":"01:46:05"},{"$f":"F29","v":"01:46:05"},{"$f":"IF(F29<I29,F29,I29)","v":"01:45:00"},28]
[29,null,null,null,null,"",{"$f":"IF($B30=\"\",\"\",(VLOOKUP($B30,Teams!$A$2:$C$41,2,FALSE)))","v":""},{"$f":"IF($B30=\"\",\"\",(VLOOKUP($B30,Teams!$A$2:$D$51,4,FALSE)))","v":""},"","","","","",""]
[30,null,null,null,null,"",{"$f":"IF($B31=\"\",\"\",(VLOOKUP($B31,Teams!$A$2:$C$41,2,FALSE)))","v":""},{"$f":"IF($B31=\"\",\"\",(VLOOKUP($B31,Teams!$A$2:$D$51,4,FALSE)))","v":""},"","","","","",""]
[31,null,null,null,null,"",{"$f":"IF($B32=\"\",\"\",(VLOOKUP($B32,Teams!$A$2:$C$41,2,FALSE)))","v":""},{"$f":"IF($B32=\"\",\"\",(VLOOKUP($B32,Teams!$A$2:$D$51,4,FALSE)))","v":""},"","","","","",""]
[32,null,null,null,null,"",{"$f":"IF($B33=\"\",\"\",(VLOOKUP($B33,Teams!$A$2:$C$41,2,FALSE)))","v":""},{"$f":"IF($B33=\"\",\"\",(VLOOKUP($B33,Teams!$A$2:$D$51,4,FALSE)))","v":""},"","","","","",""]
[33,null,null,null,null,"",{"$f":"IF($B34=\"\",\"\",(VLOOKUP($B34,Teams!$A$2:$C$41,2,FALSE)))","v":""},{"$f":"IF($B34=\"\",\"\",(VLOOKUP($B34,Teams!$A$2:$D$51,4,FALSE)))","v":""},"","","","","",""]
[34,null,null,null,null,"",{"$f":"IF($B35=\"\",\"\",(VLOOKUP($B35,Teams!$A$2:$C$41,2,FALSE)))","v":""},{"$f":"IF($B35=\"\",\"\",(VLOOKUP($B35,Teams!$A$2:$D$51,4,FALSE)))","v":""},"","","","","",""]
[35,null,null,null,null,"",{"$f":"IF($B36=\"\",\"\",(VLOOKUP($B36,Teams!$A$2:$C$41,2,FALSE)))","v":""},{"$f":"IF($B36=\"\",\"\",(VLOOKUP($B36,Teams!$A$2:$D$51,4,FALSE)))","v":""},"","","","","",""]
[36,null,null,null,null,"",{"$f":"IF($B37=\"\",\"\",(VLOOKUP($B37,Teams!$A$2:$C$41,2,FALSE)))","v":""},{"$f":"IF($B37=\"\",\"\",(VLOOKUP($B37,Teams!$A$2:$D$51,4,FALSE)))","v":""},"","","","","",""]
[37,null,null,null,null,"",{"$f":"IF($B38=\"\",\"\",(VLOOKUP($B38,Teams!$A$2:$C$41,2,FALSE)))","v":""},{"$f":"IF($B38=\"\",\"\",(VLOOKUP($B38,Teams!$A$2:$D$51,4,FALSE)))","v":""},"","","","","",""]
[38,null,null,null,null,"",{"$f":"IF($B39=\"\",\"\",(VLOOKUP($B39,Teams!$A$2:$C$41,2,FALSE)))","v":""},{"$f":"IF($B39=\"\",\"\",(VLOOKUP($B39,Teams!$A$2:$D$51,4,FALSE)))","v":""},"","","","","",""]
[39,null,null,null,null,"",{"$f":"IF($B40=\"\",\"\",(VLOOKUP($B40,Teams!$A$2:$C$41,2,FALSE)))","v":""},{"$f":"IF($B40=\"\",\"\",(VLOOKUP($B40,Teams!$A$2:$D$51,4,FALSE)))","v":""},"","","","","",""]
[40,null,null,null,null,"",{"$f":"IF($B41=\"\",\"\",(VLOOKUP($B41,Teams!$A$2:$C$41,2,FALSE)))","v":""},{"$f":"IF($B41=\"\",\"\",(VLOOKUP($B41,Teams!$A$2:$D$51,4,FALSE)))","v":""},"","","","","",""]
[41,null,null,null,null,"",{"$f":"IF($B42=\"\",\"\",(VLOOKUP($B42,Teams!$A$2:$C$41,2,FALSE)))","v":""},{"$f":"IF($B42=\"\",\"\",(VLOOKUP($B42,Teams!$A$2:$D$51,4,FALSE)))","v":""},"","",{"$f":"F42","v":""},{"$f":"F42","v":""},"",""]
[42,null,null,null,null,"",{"$f":"IF($B43=\"\",\"\",(VLOOKUP($B43,Teams!$A$2:$C$41,2,FALSE)))","v":""},{"$f":"IF($B43=\"\",\"\",(VLOOKUP($B43,Teams!$A$2:$D$51,4,FALSE)))","v":""},"","","","","",""]
[43,null,null,null,null,"",{"$f":"IF($B44=\"\",\"\",(VLOOKUP($B44,Teams!$A$2:$C$41,2,FALSE)))","v":""},{"$f":"IF($B44=\"\",\"\",(VLOOKUP($B44,Teams!$A$2:$D$51,4,FALSE)))","v":""},"","","","","",""]
[44,null,null,null,null,"",{"$f":"IF($B45=\"\",\"\",(VLOOKUP($B45,Teams!$A$2:$C$41,2,FALSE)))","v":""},{"$f":"IF($B45=\"\",\"\",(VLOOKUP($B45,Teams!$A$2:$D$51,4,FALSE)))","v":""},"","","","","",""]
[45,null,null,null,null,"",{"$f":"IF($B46=\"\",\"\",(VLOOKUP($B46,Teams!$A$2:$C$41,2,FALSE)))","v":""},{"$f":"IF($B46=\"\",\"\",(VLOOKUP($B46,Teams!$A$2:$D$51,4,FALSE)))","v":""},"","","","","",""]
[46,null,null,null,null,"",{"$f":"IF($B47=\"\",\"\",(VLOOKUP($B47,Teams!$A$2:$C$41,2,FALSE)))","v":""},{"$f":"IF($B47=\"\",\"\",(VLOOKUP($B47,Teams!$A$2:$D$51,4,FALSE)))","v":""},"","","","","",""]
[47,null,null,null,null,"",{"$f":"IF($B48=\"\",\"\",(VLOOKUP($B48,Teams!$A$2:$C$41,2,FALSE)))","v":""},{"$f":"IF($B48=\"\",\"\",(VLOOKUP($B48,Teams!$A$2:$D$51,4,FALSE)))","v":""},"","","","","",""]
[48,null,null,null,null,"",{"$f":"IF($B49=\"\",\"\",(VLOOKUP($B49,Teams!$A$2:$C$41,2,FALSE)))","v":""},{"$f":"IF($B49=\"\",\"\",(VLOOKUP($B49,Teams!$A$2:$D$51,4,FALSE)))","v":""},"","","","","",""]
[49,null,null,null,null,"",{"$f":"IF($B50=\"\",\"\",(VLOOKUP($B50,Teams!$A$2:$C$41,2,FALSE)))","v":""},{"$f":"IF($B50=\"\",\"\",(VLOOKUP($B50,Teams!$A$2:$D$51,4,FALSE)))","v":""},"","","","","",""]
[50,null,null,null,null,"",{"$f":"IF($B51=\"\",\"\",(VLOOKUP($B51,Teams!$A$2:$C$41,2,FALSE)))","v":""},{"$f":"IF($B51=\"\",\"\",(VLOOKUP($B51,Teams!$A$2:$D$51,4,FALSE)))","v":""},"","","","","",""]

{"sheet":"HardCopy1","index":7,"n_rows":51,"n_cols":6,"rows_kept":51,"cut":false,"hidden":false,"merged":[]}
["Position","Number","Cuml Time","Club","M/F/X","Over MST"]
[1,31,"01:00:17","Bingley A Holes","Male","00:00:00"]
[2,49,"01:03:57","Real Men Wear Pink","Mixed","00:00:00"]
[3,36,"01:04:12","Annie's Dream Team","Mixed","00:00:00"]
[4,42,"01:09:18","Pudsey P Comets","Mixed","00:00:00"]
[5,52,"01:09:34","Keighley & Craven A ","Male","00:00:00"]
[6,39,"01:10:07","St Nicks","Mixed","00:00:00"]
[7,32,"01:10:27","Bingley B Stards","Male","00:00:00"]
[8,33,"01:11:10","Bingley C Rappers","Male","00:00:00"]
[9,40,"01:12:16","Pudsey P Vixens","Female","00:00:00"]
[10,50,"01:12:50","Barlick 3 Belles","Female","00:00:00"]
[11,37,"01:13:32","Doddy Superhero","Mixed","00:00:00"]
[12,53,"01:14:11","Keighley & Craven B","Male","00:00:00"]
[13,48,"01:18:12","Rudolf Needs A Vet","Mixed","00:00:00"]
[14,55,"01:18:52","Bingley Angels","Female","00:00:00"]
[15,44,"01:19:22","K & C Arsey Amblers","Female","00:00:00"]
[16,57,"01:19:32","Bingley Belles","Female","00:00:00"]
[17,41,"01:19:36","Pudsey P Prancers","Male","00:00:00"]
[18,54,"01:20:17","Keighley & Craven C","Male","00:00:00"]
[19,34,"01:21:04","Cononley","Mixed","00:00:00"]
[20,56,"01:22:00","Bingley Babes","Female","00:00:00"]
[21,35,"01:22:07","Skipton","Mixed","00:00:00"]
[22,38,"01:26:27","Kirkham MX","Mixed","00:00:00"]
[23,43,"01:28:02","Pudsey P Dancers","Mixed","00:00:00"]
[24,58,"01:29:18","Hail Marys","Female","00:00:00"]
[25,45,"01:30:48","K & C Bottom Bloomers!!","Female","00:00:00"]
[26,46,"01:31:01","K & C Mega Munchers","Mixed","00:00:00"]
[27,51,"01:32:16","Barlick 4","Female","00:00:00"]
[28,47,"01:46:05","K & C Marvellous Mincers!","Mixed","00:01:05"]
[29,null,"","","",""]
[30,null,"","","",""]
[31,null,"","","",""]
[32,null,"","","",""]
[33,null,"","","",""]
[34,null,"","","",""]
[35,null,"","","",""]
[36,null,"","","",""]
[37,null,"","","",""]
[38,null,"","","",""]
[39,null,"","","",""]
[40,null,"","","",""]
[41,null,"","","",""]
[42,null,"","","",""]
[43,null,"","","",""]
[44,null,"","","",""]
[45,null,"","","",""]
[46,null,"","","",""]
[47,null,"","","",""]
[48,null,"","","",""]
[49,null,"","","",""]
[50,null,"","","",""]

{"sheet":"ResultsB","index":8,"n_rows":51,"n_cols":16,"rows_kept":51,"cut":false,"hidden":true,"merged":[]}
["Position","Number","hours","mins","secs","Cuml Time","Club","M/F/X","MST Cuml2","Over MST","ALT2","ACT2","SOT2","LFP2",null,"03:15:00"]
[1,31,2,6,46,{"$f":"IF(B2=\"\",\"\",TIME(C2,D2,E2))","v":"02:06:46"},{"$f":"IF($B2=\"\",\"\",(VLOOKUP($B2,Teams!$A$2:$C$51,2,FALSE)))","v":"Bingley A Holes"},{"$f":"IF($B2=\"\",\"\",(VLOOKUP($B2,Teams!$A$2:$D$51,4,FALSE)))","v":"Male"},{"$f":"IF(B2=\"\",\"\",$P$1)","v":"03:15:00"},{"$f":"IFERROR(IF((F2-I2)>0,F2-I2,0),\"\")","v":"00:00:00"},{"$f":"IFERROR(VLOOKUP(B2,$B$2:$F$51,5,0)-VLOOKUP(B2,ResultsA!$B$2:$M$51,12,0),\"\")","v":"01:06:29"},{"$f":"IFERROR(VLOOKUP(B2,$B$2:$K$51,10,0)+VLOOKUP(B2,ResultsA!$B$2:$F$51,5,FALSE),\"\")","v":"02:06:46"},{"$f":"IF(F2<I2,F2,I2)","v":"02:06:46"},{"$f":"IF(B2=\"\",\"\",RANK(L2,$L$2:$L$51,1))","v":1}]
[2,36,2,7,41,{"$f":"IF(B3=\"\",\"\",TIME(C3,D3,E3))","v":"02:07:41"},{"$f":"IF($B3=\"\",\"\",(VLOOKUP($B3,Teams!$A$2:$C$51,2,FALSE)))","v":"Annie's Dream Team"},{"$f":"IF($B3=\"\",\"\",(VLOOKUP($B3,Teams!$A$2:$D$51,4,FALSE)))","v":"Mixed"},{"$f":"IF(B3=\"\",\"\",$P$1)","v":"03:15:00"},"00:00:00",{"$f":"IFERROR(VLOOKUP(B3,$B$2:$F$51,5,0)-VLOOKUP(B3,ResultsA!$B$2:$M$51,12,0),\"\")","v":"01:03:29"},{"$f":"IFERROR(VLOOKUP(B3,$B$2:$K$51,10,0)+VLOOKUP(B3,ResultsA!$B$2:$F$51,5,FALSE),\"\")","v":"02:07:41"},{"$f":"IF(F3<I3,F3,I3)","v":"02:07:41"},{"$f":"IF(B3=\"\",\"\",RANK(L3,$L$2:$L$51,1))","v":2}]
[3,52,2,16,27,"02:16:27",{"$f":"IF($B4=\"\",\"\",(VLOOKUP($B4,Teams!$A$2:$C$51,2,FALSE)))","v":"Keighley & Craven A "},{"$f":"IF($B4=\"\",\"\",(VLOOKUP($B4,Teams!$A$2:$D$51,4,FALSE)))","v":"Male"},"03:15:00","00:00:00",{"$f":"IFERROR(VLOOKUP(B4,$B$2:$F$51,5,0)-VLOOKUP(B4,ResultsA!$B$2:$M$51,12,0),\"\")","v":"01:06:53"},{"$f":"IFERROR(VLOOKUP(B4,$B$2:$K$51,10,0)+VLOOKUP(B4,ResultsA!$B$2:$F$51,5,FALSE),\"\")","v":"02:16:27"},"02:16:27",3]
[4,49,2,21,24,"02:21:24",{"$f":"IF($B5=\"\",\"\",(VLOOKUP($B5,Teams!$A$2:$C$51,2,FALSE)))","v":"Real Men Wear Pink"},{"$f":"IF($B5=\"\",\"\",(VLOOKUP($B5,Teams!$A$2:$D$51,4,FALSE)))","v":"Mixed"},"03:15:00","00:00:00",{"$f":"IFERROR(VLOOKUP(B5,$B$2:$F$51,5,0)-VLOOKUP(B5,ResultsA!$B$2:$M$51,12,0),\"\")","v":"01:17:27"},{"$f":"IFERROR(VLOOKUP(B5,$B$2:$K$51,10,0)+VLOOKUP(B5,ResultsA!$B$2:$F$51,5,FALSE),\"\")","v":"02:21:24"},"02:21:24",4]
[5,50,2,26,35,"02:26:35",{"$f":"IF($B6=\"\",\"\",(VLOOKUP($B6,Teams!$A$2:$C$51,2,FALSE)))","v":"Barlick 3 Belles"},{"$f":"IF($B6=\"\",\"\",(VLOOKUP($B6,Teams!$A$2:$D$51,4,FALSE)))","v":"Female"},"03:15:00","00:00:00",{"$f":"IFERROR(VLOOKUP(B6,$B$2:$F$51,5,0)-VLOOKUP(B6,ResultsA!$B$2:$M$51,12,0),\"\")","v":"01:13:45"},{"$f":"IFERROR(VLOOKUP(B6,$B$2:$K$51,10,0)+VLOOKUP(B6,ResultsA!$B$2:$F$51,5,FALSE),\"\")","v":"02:26:35"},"02:26:35",5]
[6,37,2,29,42,"02:29:42",{"$f":"IF($B7=\"\",\"\",(VLOOKUP($B7,Teams!$A$2:$C$51,2,FALSE)))","v":"Doddy Superhero"},{"$f":"IF($B7=\"\",\"\",(VLOOKUP($B7,Teams!$A$2:$D$51,4,FALSE)))","v":"Mixed"},"03:15:00","00:00:00",{"$f":"IFERROR(VLOOKUP(B7,$B$2:$F$51,5,0)-VLOOKUP(B7,ResultsA!$B$2:$M$51,12,0),\"\")","v":"01:16:10"},{"$f":"IFERROR(VLOOKUP(B7,$B$2:$K$51,10,0)+VLOOKUP(B7,ResultsA!$B$2:$F$51,5,FALSE),\"\")","v":"02:29:42"},"02:29:42",6]
[7,39,2,29,49,"02:29:49",{"$f":"IF($B8=\"\",\"\",(VLOOKUP($B8,Teams!$A$2:$C$51,2,FALSE)))","v":"St Nicks"},{"$f":"IF($B8=\"\",\"\",(VLOOKUP($B8,Teams!$A$2:$D$51,4,FALSE)))","v":"Mixed"},"03:15:00","00:00:00",{"$f":"IFERROR(VLOOKUP(B8,$B$2:$F$51,5,0)-VLOOKUP(B8,ResultsA!$B$2:$M$51,12,0),\"\")","v":"01:19:42"},{"$f":"IFERROR(VLOOKUP(B8,$B$2:$K$51,10,0)+VLOOKUP(B8,ResultsA!$B$2:$F$51,5,FALSE),\"\")","v":"02:29:49"},"02:29:49",7]
[8,33,2,31,30,"02:31:30",{"$f":"IF($B9=\"\",\"\",(VLOOKUP($B9,Teams!$A$2:$C$51,2,FALSE)))","v":"Bingley C Rappers"},{"$f":"IF($B9=\"\",\"\",(VLOOKUP($B9,Teams!$A$2:$D$51,4,FALSE)))","v":"Male"},"03:15:00","00:00:00",{"$f":"IFERROR(VLOOKUP(B9,$B$2:$F$51,5,0)-VLOOKUP(B9,ResultsA!$B$2:$M$51,12,0),\"\")","v":"01:20:20"},{"$f":"IFERROR(VLOOKUP(B9,$B$2:$K$51,10,0)+VLOOKUP(B9,ResultsA!$B$2:$F$51,5,FALSE),\"\")","v":"02:31:30"},"02:31:30",8]
[9,41,2,34,33,"02:34:33",{"$f":"IF($B10=\"\",\"\",(VLOOKUP($B10,Teams!$A$2:$C$51,2,FALSE)))","v":"Pudsey P Prancers"},{"$f":"IF($B10=\"\",\"\",(VLOOKUP($B10,Teams!$A$2:$D$51,4,FALSE)))","v":"Male"},"03:15:00","00:00:00",{"$f":"IFERROR(VLOOKUP(B10,$B$2:$F$51,5,0)-VLOOKUP(B10,ResultsA!$B$2:$M$51,12,0),\"\")","v":"01:14:57"},{"$f":"IFERROR(VLOOKUP(B10,$B$2:$K$51,10,0)+VLOOKUP(B10,ResultsA!$B$2:$F$51,5,FALSE),\"\")","v":"02:34:33"},"02:34:33",9]
[10,38,2,34,53,"02:34:53",{"$f":"IF($B11=\"\",\"\",(VLOOKUP($B11,Teams!$A$2:$C$51,2,FALSE)))","v":"Kirkham MX"},{"$f":"IF($B11=\"\",\"\",(VLOOKUP($B11,Teams!$A$2:$D$51,4,FALSE)))","v":"Mixed"},"03:15:00","00:00:00",{"$f":"IFERROR(VLOOKUP(B11,$B$2:$F$51,5,0)-VLOOKUP(B11,ResultsA!$B$2:$M$51,12,0),\"\")","v":"01:08:26"},{"$f":"IFERROR(VLOOKUP(B11,$B$2:$K$51,10,0)+VLOOKUP(B11,ResultsA!$B$2:$F$51,5,FALSE),\"\")","v":"02:34:53"},"02:34:53",10]
[11,35,2,35,27,"02:35:27",{"$f":"IF($B12=\"\",\"\",(VLOOKUP($B12,Teams!$A$2:$C$51,2,FALSE)))","v":"Skipton"},{"$f":"IF($B12=\"\",\"\",(VLOOKUP($B12,Teams!$A$2:$D$51,4,FALSE)))","v":"Mixed"},"03:15:00","00:00:00",{"$f":"IFERROR(VLOOKUP(B12,$B$2:$F$51,5,0)-VLOOKUP(B12,ResultsA!$B$2:$M$51,12,0),\"\")","v":"01:13:20"},{"$f":"IFERROR(VLOOKUP(B12,$B$2:$K$51,10,0)+VLOOKUP(B12,ResultsA!$B$2:$F$51,5,FALSE),\"\")","v":"02:35:27"},"02:35:27",11]
[12,53,2,35,39,"02:35:39",{"$f":"IF($B13=\"\",\"\",(VLOOKUP($B13,Teams!$A$2:$C$51,2,FALSE)))","v":"Keighley & Craven B"},{"$f":"IF($B13=\"\",\"\",(VLOOKUP($B13,Teams!$A$2:$D$51,4,FALSE)))","v":"Male"},"03:15:00","00:00:00",{"$f":"IFERROR(VLOOKUP(B13,$B$2:$F$51,5,0)-VLOOKUP(B13,ResultsA!$B$2:$M$51,12,0),\"\")","v":"01:21:28"},{"$f":"IFERROR(VLOOKUP(B13,$B$2:$K$51,10,0)+VLOOKUP(B13,ResultsA!$B$2:$F$51,5,FALSE),\"\")","v":"02:35:39"},"02:35:39",12]
[13,48,2,35,49,"02:35:49",{"$f":"IF($B14=\"\",\"\",(VLOOKUP($B14,Teams!$A$2:$C$51,2,FALSE)))","v":"Rudolf Needs A Vet"},{"$f":"IF($B14=\"\",\"\",(VLOOKUP($B14,Teams!$A$2:$D$51,4,FALSE)))","v":"Mixed"},"03:15:00","00:00:00",{"$f":"IFERROR(VLOOKUP(B14,$B$2:$F$51,5,0)-VLOOKUP(B14,ResultsA!$B$2:$M$51,12,0),\"\")","v":"01:17:37"},{"$f":"IFERROR(VLOOKUP(B14,$B$2:$K$51,10,0)+VLOOKUP(B14,ResultsA!$B$2:$F$51,5,FALSE),\"\")","v":"02:35:49"},"02:35:49",13]
[14,44,2,35,53,"02:35:53",{"$f":"IF($B15=\"\",\"\",(VLOOKUP($B15,Teams!$A$2:$C$51,2,FALSE)))","v":"K & C Arsey Amblers"},{"$f":"IF($B15=\"\",\"\",(VLOOKUP($B15,Teams!$A$2:$D$51,4,FALSE)))","v":"Female"},"03:15:00","00:00:00",{"$f":"IFERROR(VLOOKUP(B15,$B$2:$F$51,5,0)-VLOOKUP(B15,ResultsA!$B$2:$M$51,12,0),\"\")","v":"01:16:31"},{"$f":"IFERROR(VLOOKUP(B15,$B$2:$K$51,10,0)+VLOOKUP(B15,ResultsA!$B$2:$F$51,5,FALSE),\"\")","v":"02:35:53"},"02:35:53",14]
[15,32,2,36,53,"02:36:53",{"$f":"IF($B16=\"\",\"\",(VLOOKUP($B16,Teams!$A$2:$C$51,2,FALSE)))","v":"Bingley B Stards"},{"$f":"IF($B16=\"\",\"\",(VLOOKUP($B16,Teams!$A$2:$D$51,4,FALSE)))","v":"Male"},"03:15:00","00:00:00",{"$f":"IFERROR(VLOOKUP(B16,$B$2:$F$51,5,0)-VLOOKUP(B16,ResultsA!$B$2:$M$51,12,0),\"\")","v":"01:26:26"},{"$f":"IFERROR(VLOOKUP(B16,$B$2:$K$51,10,0)+VLOOKUP(B16,ResultsA!$B$2:$F$51,5,FALSE),\"\")","v":"02:36:53"},"02:36:53",15]
[16,55,2,38,26,"02:38:26",{"$f":"IF($B17=\"\",\"\",(VLOOKUP($B17,Teams!$A$2:$C$51,2,FALSE)))","v":"Bingley Angels"},{"$f":"IF($B17=\"\",\"\",(VLOOKUP($B17,Teams!$A$2:$D$51,4,FALSE)))","v":"Female"},"03:15:00","00:00:00",{"$f":"IFERROR(VLOOKUP(B17,$B$2:$F$51,5,0)-VLOOKUP(B17,ResultsA!$B$2:$M$51,12,0),\"\")","v":"01:19:34"},{"$f":"IFERROR(VLOOKUP(B17,$B$2:$K$51,10,0)+VLOOKUP(B17,ResultsA!$B$2:$F$51,5,FALSE),\"\")","v":"02:38:26"},"02:38:26",16]
[17,42,2,41,37,"02:41:37",{"$f":"IF($B18=\"\",\"\",(VLOOKUP($B18,Teams!$A$2:$C$51,2,FALSE)))","v":"Pudsey P Comets"},{"$f":"IF($B18=\"\",\"\",(VLOOKUP($B18,Teams!$A$2:$D$51,4,FALSE)))","v":"Mixed"},"03:15:00","00:00:00",{"$f":"IFERROR(VLOOKUP(B18,$B$2:$F$51,5,0)-VLOOKUP(B18,ResultsA!$B$2:$M$51,12,0),\"\")","v":"01:32:19"},{"$f":"IFERROR(VLOOKUP(B18,$B$2:$K$51,10,0)+VLOOKUP(B18,ResultsA!$B$2:$F$51,5,FALSE),\"\")","v":"02:41:37"},"02:41:37",17]
[18,54,2,45,45,"02:45:45",{"$f":"IF($B19=\"\",\"\",(VLOOKUP($B19,Teams!$A$2:$C$51,2,FALSE)))","v":"Keighley & Craven C"},{"$f":"IF($B19=\"\",\"\",(VLOOKUP($B19,Teams!$A$2:$D$51,4,FALSE)))","v":"Male"},"03:15:00","00:00:00",{"$f":"IFERROR(VLOOKUP(B19,$B$2:$F$51,5,0)-VLOOKUP(B19,ResultsA!$B$2:$M$51,12,0),\"\")","v":"01:25:28"},{"$f":"IFERROR(VLOOKUP(B19,$B$2:$K$51,10,0)+VLOOKUP(B19,ResultsA!$B$2:$F$51,5,FALSE),\"\")","v":"02:45:45"},"02:45:45",18]
[19,40,2,48,28,"02:48:28",{"$f":"IF($B20=\"\",\"\",(VLOOKUP($B20,Teams!$A$2:$C$51,2,FALSE)))","v":"Pudsey P Vixens"},{"$f":"IF($B20=\"\",\"\",(VLOOKUP($B20,Teams!$A$2:$D$51,4,FALSE)))","v":"Female"},"03:15:00","00:00:00",{"$f":"IFERROR(VLOOKUP(B20,$B$2:$F$51,5,0)-VLOOKUP(B20,ResultsA!$B$2:$M$51,12,0),\"\")","v":"01:36:12"},{"$f":"IFERROR(VLOOKUP(B20,$B$2:$K$51,10,0)+VLOOKUP(B20,ResultsA!$B$2:$F$51,5,FALSE),\"\")","v":"02:48:28"},"02:48:28",19]
[20,56,2,51,6,"02:51:06",{"$f":"IF($B21=\"\",\"\",(VLOOKUP($B21,Teams!$A$2:$C$51,2,FALSE)))","v":"Bingley Babes"},{"$f":"IF($B21=\"\",\"\",(VLOOKUP($B21,Teams!$A$2:$D$51,4,FALSE)))","v":"Female"},"03:15:00","00:00:00",{"$f":"IFERROR(VLOOKUP(B21,$B$2:$F$51,5,0)-VLOOKUP(B21,ResultsA!$B$2:$M$51,12,0),\"\")","v":"01:29:06"},{"$f":"IFERROR(VLOOKUP(B21,$B$2:$K$51,10,0)+VLOOKUP(B21,ResultsA!$B$2:$F$51,5,FALSE),\"\")","v":"02:51:06"},"02:51:06",20]
[21,34,3,1,1,"03:01:01",{"$f":"IF($B22=\"\",\"\",(VLOOKUP($B22,Teams!$A$2:$C$51,2,FALSE)))","v":"Cononley"},{"$f":"IF($B22=\"\",\"\",(VLOOKUP($B22,Teams!$A$2:$D$51,4,FALSE)))","v":"Mixed"},"03:15:00","00:00:00",{"$f":"IFERROR(VLOOKUP(B22,$B$2:$F$51,5,0)-VLOOKUP(B22,ResultsA!$B$2:$M$51,12,0),\"\")","v":"01:39:57"},{"$f":"IFERROR(VLOOKUP(B22,$B$2:$K$51,10,0)+VLOOKUP(B22,ResultsA!$B$2:$F$51,5,FALSE),\"\")","v":"03:01:01"},"03:01:01",21]
[22,57,3,7,15,"03:07:15",{"$f":"IF($B23=\"\",\"\",(VLOOKUP($B23,Teams!$A$2:$C$51,2,FALSE)))","v":"Bingley Belles"},{"$f":"IF($B23=\"\",\"\",(VLOOKUP($B23,Teams!$A$2:$D$51,4,FALSE)))","v":"Female"},"03:15:00","00:00:00",{"$f":"IFERROR(VLOOKUP(B23,$B$2:$F$51,5,0)-VLOOKUP(B23,ResultsA!$B$2:$M$51,12,0),\"\")","v":"01:47:43"},{"$f":"IFERROR(VLOOKUP(B23,$B$2:$K$51,10,0)+VLOOKUP(B23,ResultsA!$B$2:$F$51,5,FALSE),\"\")","v":"03:07:15"},"03:07:15",22]
[23,51,3,10,15,"03:10:15",{"$f":"IF($B24=\"\",\"\",(VLOOKUP($B24,Teams!$A$2:$C$51,2,FALSE)))","v":"Barlick 4"},{"$f":"IF($B24=\"\",\"\",(VLOOKUP($B24,Teams!$A$2:$D$51,4,FALSE)))","v":"Female"},"03:15:00","00:00:00",{"$f":"IFERROR(VLOOKUP(B24,$B$2:$F$51,5,0)-VLOOKUP(B24,ResultsA!$B$2:$M$51,12,0),\"\")","v":"01:37:59"},{"$f":"IFERROR(VLOOKUP(B24,$B$2:$K$51,10,0)+VLOOKUP(B24,ResultsA!$B$2:$F$51,5,FALSE),\"\")","v":"03:10:15"},"03:10:15",23]
[24,43,3,12,16,"03:12:16",{"$f":"IF($B25=\"\",\"\",(VLOOKUP($B25,Teams!$A$2:$C$51,2,FALSE)))","v":"Pudsey P Dancers"},{"$f":"IF($B25=\"\",\"\",(VLOOKUP($B25,Teams!$A$2:$D$51,4,FALSE)))","v":"Mixed"},"03:15:00","00:00:00",{"$f":"IFERROR(VLOOKUP(B25,$B$2:$F$51,5,0)-VLOOKUP(B25,ResultsA!$B$2:$M$51,12,0),\"\")","v":"01:44:14"},{"$f":"IFERROR(VLOOKUP(B25,$B$2:$K$51,10,0)+VLOOKUP(B25,ResultsA!$B$2:$F$51,5,FALSE),\"\")","v":"03:12:16"},"03:12:16",24]
[25,58,3,14,10,"03:14:10",{"$f":"IF($B26=\"\",\"\",(VLOOKUP($B26,Teams!$A$2:$C$51,2,FALSE)))","v":"Hail Marys"},{"$f":"IF($B26=\"\",\"\",(VLOOKUP($B26,Teams!$A$2:$D$51,4,FALSE)))","v":"Female"},"03:15:00","00:00:00",{"$f":"IFERROR(VLOOKUP(B26,$B$2:$F$51,5,0)-VLOOKUP(B26,ResultsA!$B$2:$M$51,12,0),\"\")","v":"01:44:52"},{"$f":"IFERROR(VLOOKUP(B26,$B$2:$K$51,10,0)+VLOOKUP(B26,ResultsA!$B$2:$F$51,5,FALSE),\"\")","v":"03:14:10"},"03:14:10",25]
[26,45,3,23,22,"03:23:22",{"$f":"IF($B27=\"\",\"\",(VLOOKUP($B27,Teams!$A$2:$C$51,2,FALSE)))","v":"K & C Bottom Bloomers!!"},{"$f":"IF($B27=\"\",\"\",(VLOOKUP($B27,Teams!$A$2:$D$51,4,FALSE)))","v":"Female"},"03:15:00","00:08:22",{"$f":"IFERROR(VLOOKUP(B27,$B$2:$F$51,5,0)-VLOOKUP(B27,ResultsA!$B$2:$M$51,12,0),\"\")","v":"01:52:34"},{"$f":"IFERROR(VLOOKUP(B27,$B$2:$K$51,10,0)+VLOOKUP(B27,ResultsA!$B$2:$F$51,5,FALSE),\"\")","v":"03:23:22"},"03:15:00",26]
[27,46,3,23,23,"03:23:23",{"$f":"IF($B28=\"\",\"\",(VLOOKUP($B28,Teams!$A$2:$C$51,2,FALSE)))","v":"K & C Mega Munchers"},{"$f":"IF($B28=\"\",\"\",(VLOOKUP($B28,Teams!$A$2:$D$51,4,FALSE)))","v":"Mixed"},"03:15:00","00:08:23",{"$f":"IFERROR(VLOOKUP(B28,$B$2:$F$51,5,0)-VLOOKUP(B28,ResultsA!$B$2:$M$51,12,0),\"\")","v":"01:52:22"},{"$f":"IFERROR(K28+VLOOKUP(B28,ResultsA!$B$2:$F$51,5,FALSE),\"\")","v":"03:23:23"},"03:15:00",27]
[28,47,3,49,18,"03:49:18",{"$f":"IF($B29=\"\",\"\",(VLOOKUP($B29,Teams!$A$2:$C$51,2,FALSE)))","v":"K & C Marvellous Mincers!"},{"$f":"IF($B29=\"\",\"\",(VLOOKUP($B29,Teams!$A$2:$D$51,4,FALSE)))","v":"Mixed"},"03:15:00","00:34:18",{"$f":"IFERROR(VLOOKUP(B29,$B$2:$F$51,5,0)-VLOOKUP(B29,ResultsA!$B$2:$M$51,12,0),\"\")","v":"02:04:18"},{"$f":"IFERROR(VLOOKUP(B29,$B$2:$K$51,10,0)+VLOOKUP(B29,ResultsA!$B$2:$F$51,5,FALSE),\"\")","v":"03:50:23"},"03:15:00",28]
[29,null,null,null,null,"",{"$f":"IF($B30=\"\",\"\",(VLOOKUP($B30,Teams!$A$2:$C$51,2,FALSE)))","v":""},{"$f":"IF($B30=\"\",\"\",(VLOOKUP($B30,Teams!$A$2:$D$51,4,FALSE)))","v":""},"","",{"$f":"IFERROR(VLOOKUP(B30,$B$2:$F$51,5,0)-VLOOKUP(B30,ResultsA!$B$2:$M$51,12,0),\"\")","v":""},{"$f":"IFERROR(VLOOKUP(B30,$B$2:$K$51,10,0)+VLOOKUP(B30,ResultsA!$B$2:$F$51,5,FALSE),\"\")","v":""},"",""]
[30,null,null,null,null,"",{"$f":"IF($B31=\"\",\"\",(VLOOKUP($B31,Teams!$A$2:$C$51,2,FALSE)))","v":""},{"$f":"IF($B31=\"\",\"\",(VLOOKUP($B31,Teams!$A$2:$D$51,4,FALSE)))","v":""},"","",null,{"$f":"IFERROR(VLOOKUP(B31,$B$2:$K$51,10,0)+VLOOKUP(B31,ResultsA!$B$2:$F$51,5,FALSE),\"\")","v":""},"",""]
[31,null,null,null,null,"",{"$f":"IF($B32=\"\",\"\",(VLOOKUP($B32,Teams!$A$2:$C$51,2,FALSE)))","v":""},{"$f":"IF($B32=\"\",\"\",(VLOOKUP($B32,Teams!$A$2:$D$51,4,FALSE)))","v":""},"","",{"$f":"IFERROR(VLOOKUP(B32,$B$2:$F$51,5,0)-VLOOKUP(B32,ResultsA!$B$2:$M$51,12,0),\"\")","v":""},{"$f":"IFERROR(VLOOKUP(B32,$B$2:$K$51,10,0)+VLOOKUP(B32,ResultsA!$B$2:$F$51,5,FALSE),\"\")","v":""},"",""]
[32,null,null,null,null,"",{"$f":"IF($B33=\"\",\"\",(VLOOKUP($B33,Teams!$A$2:$C$51,2,FALSE)))","v":""},{"$f":"IF($B33=\"\",\"\",(VLOOKUP($B33,Teams!$A$2:$D$51,4,FALSE)))","v":""},"","",{"$f":"IFERROR(VLOOKUP(B33,$B$2:$F$51,5,0)-VLOOKUP(B33,ResultsA!$B$2:$M$51,12,0),\"\")","v":""},{"$f":"IFERROR(VLOOKUP(B33,$B$2:$K$51,10,0)+VLOOKUP(B33,ResultsA!$B$2:$F$51,5,FALSE),\"\")","v":""},"",""]
[33,null,null,null,null,"",{"$f":"IF($B34=\"\",\"\",(VLOOKUP($B34,Teams!$A$2:$C$51,2,FALSE)))","v":""},{"$f":"IF($B34=\"\",\"\",(VLOOKUP($B34,Teams!$A$2:$D$51,4,FALSE)))","v":""},"","",{"$f":"IFERROR(VLOOKUP(B34,$B$2:$F$51,5,0)-VLOOKUP(B34,ResultsA!$B$2:$M$51,12,0),\"\")","v":""},{"$f":"IFERROR(VLOOKUP(B34,$B$2:$K$51,10,0)+VLOOKUP(B34,ResultsA!$B$2:$F$51,5,FALSE),\"\")","v":""},"",""]
[34,null,null,null,null,"",{"$f":"IF($B35=\"\",\"\",(VLOOKUP($B35,Teams!$A$2:$C$51,2,FALSE)))","v":""},{"$f":"IF($B35=\"\",\"\",(VLOOKUP($B35,Teams!$A$2:$D$51,4,FALSE)))","v":""},"","",{"$f":"IFERROR(VLOOKUP(B35,$B$2:$F$51,5,0)-VLOOKUP(B35,ResultsA!$B$2:$M$51,12,0),\"\")","v":""},{"$f":"IFERROR(VLOOKUP(B35,$B$2:$K$51,10,0)+VLOOKUP(B35,ResultsA!$B$2:$F$51,5,FALSE),\"\")","v":""},"",""]
[35,null,null,null,null,"",{"$f":"IF($B36=\"\",\"\",(VLOOKUP($B36,Teams!$A$2:$C$51,2,FALSE)))","v":""},{"$f":"IF($B36=\"\",\"\",(VLOOKUP($B36,Teams!$A$2:$D$51,4,FALSE)))","v":""},"","",{"$f":"IFERROR(VLOOKUP(B36,$B$2:$F$51,5,0)-VLOOKUP(B36,ResultsA!$B$2:$M$51,12,0),\"\")","v":""},{"$f":"IFERROR(VLOOKUP(B36,$B$2:$K$51,10,0)+VLOOKUP(B36,ResultsA!$B$2:$F$51,5,FALSE),\"\")","v":""},"",""]
[36,null,null,null,null,"",{"$f":"IF($B37=\"\",\"\",(VLOOKUP($B37,Teams!$A$2:$C$51,2,FALSE)))","v":""},{"$f":"IF($B37=\"\",\"\",(VLOOKUP($B37,Teams!$A$2:$D$51,4,FALSE)))","v":""},"","",{"$f":"IFERROR(VLOOKUP(B37,$B$2:$F$51,5,0)-VLOOKUP(B37,ResultsA!$B$2:$M$51,12,0),\"\")","v":""},{"$f":"IFERROR(VLOOKUP(B37,$B$2:$K$51,10,0)+VLOOKUP(B37,ResultsA!$B$2:$F$51,5,FALSE),\"\")","v":""},"",""]
[37,null,null,null,null,"",{"$f":"IF($B38=\"\",\"\",(VLOOKUP($B38,Teams!$A$2:$C$51,2,FALSE)))","v":""},{"$f":"IF($B38=\"\",\"\",(VLOOKUP($B38,Teams!$A$2:$D$51,4,FALSE)))","v":""},"","",{"$f":"IFERROR(VLOOKUP(B38,$B$2:$F$51,5,0)-VLOOKUP(B38,ResultsA!$B$2:$M$51,12,0),\"\")","v":""},{"$f":"IFERROR(VLOOKUP(B38,$B$2:$K$51,10,0)+VLOOKUP(B38,ResultsA!$B$2:$F$51,5,FALSE),\"\")","v":""},"",""]
[38,null,null,null,null,"",{"$f":"IF($B39=\"\",\"\",(VLOOKUP($B39,Teams!$A$2:$C$51,2,FALSE)))","v":""},{"$f":"IF($B39=\"\",\"\",(VLOOKUP($B39,Teams!$A$2:$D$51,4,FALSE)))","v":""},"","",{"$f":"IFERROR(VLOOKUP(B39,$B$2:$F$51,5,0)-VLOOKUP(B39,ResultsA!$B$2:$M$51,12,0),\"\")","v":""},{"$f":"IFERROR(VLOOKUP(B39,$B$2:$K$51,10,0)+VLOOKUP(B39,ResultsA!$B$2:$F$51,5,FALSE),\"\")","v":""},"",""]
[39,null,null,null,null,"",{"$f":"IF($B40=\"\",\"\",(VLOOKUP($B40,Teams!$A$2:$C$51,2,FALSE)))","v":""},{"$f":"IF($B40=\"\",\"\",(VLOOKUP($B40,Teams!$A$2:$D$51,4,FALSE)))","v":""},"","",{"$f":"IFERROR(VLOOKUP(B40,$B$2:$F$51,5,0)-VLOOKUP(B40,ResultsA!$B$2:$M$51,12,0),\"\")","v":""},{"$f":"IFERROR(VLOOKUP(B40,$B$2:$K$51,10,0)+VLOOKUP(B40,ResultsA!$B$2:$F$51,5,FALSE),\"\")","v":""},"",""]
[40,null,null,null,null,"",{"$f":"IF($B41=\"\",\"\",(VLOOKUP($B41,Teams!$A$2:$C$51,2,FALSE)))","v":""},{"$f":"IF($B41=\"\",\"\",(VLOOKUP($B41,Teams!$A$2:$D$51,4,FALSE)))","v":""},"","",{"$f":"IFERROR(VLOOKUP(B41,$B$2:$F$51,5,0)-VLOOKUP(B41,ResultsA!$B$2:$M$51,12,0),\"\")","v":""},{"$f":"IFERROR(VLOOKUP(B41,$B$2:$K$51,10,0)+VLOOKUP(B41,ResultsA!$B$2:$F$51,5,FALSE),\"\")","v":""},"",""]
[41,null,null,null,null,"",{"$f":"IF($B42=\"\",\"\",(VLOOKUP($B42,Teams!$A$2:$C$51,2,FALSE)))","v":""},{"$f":"IF($B42=\"\",\"\",(VLOOKUP($B42,Teams!$A$2:$D$51,4,FALSE)))","v":""},"","",{"$f":"IFERROR(VLOOKUP(B42,$B$2:$F$51,5,0)-VLOOKUP(B42,ResultsA!$B$2:$M$51,12,0),\"\")","v":""},{"$f":"IFERROR(VLOOKUP(B42,$B$2:$K$51,10,0)+VLOOKUP(B42,ResultsA!$B$2:$F$51,5,FALSE),\"\")","v":""},"",""]
[42,null,null,null,null,"",{"$f":"IF($B43=\"\",\"\",(VLOOKUP($B43,Teams!$A$2:$C$51,2,FALSE)))","v":""},{"$f":"IF($B43=\"\",\"\",(VLOOKUP($B43,Teams!$A$2:$D$51,4,FALSE)))","v":""},"","",{"$f":"IFERROR(VLOOKUP(B43,$B$2:$F$51,5,0)-VLOOKUP(B43,ResultsA!$B$2:$M$51,12,0),\"\")","v":""},{"$f":"IFERROR(VLOOKUP(B43,$B$2:$K$51,10,0)+VLOOKUP(B43,ResultsA!$B$2:$F$51,5,FALSE),\"\")","v":""},"",""]
[43,null,null,null,null,"",{"$f":"IF($B44=\"\",\"\",(VLOOKUP($B44,Teams!$A$2:$C$51,2,FALSE)))","v":""},{"$f":"IF($B44=\"\",\"\",(VLOOKUP($B44,Teams!$A$2:$D$51,4,FALSE)))","v":""},"","",{"$f":"IFERROR(VLOOKUP(B44,$B$2:$F$51,5,0)-VLOOKUP(B44,ResultsA!$B$2:$M$51,12,0),\"\")","v":""},{"$f":"IFERROR(VLOOKUP(B44,$B$2:$K$51,10,0)+VLOOKUP(B44,ResultsA!$B$2:$F$51,5,FALSE),\"\")","v":""},"",""]
[44,null,null,null,null,"",{"$f":"IF($B45=\"\",\"\",(VLOOKUP($B45,Teams!$A$2:$C$51,2,FALSE)))","v":""},{"$f":"IF($B45=\"\",\"\",(VLOOKUP($B45,Teams!$A$2:$D$51,4,FALSE)))","v":""},"","",{"$f":"IFERROR(VLOOKUP(B45,$B$2:$F$51,5,0)-VLOOKUP(B45,ResultsA!$B$2:$M$51,12,0),\"\")","v":""},{"$f":"IFERROR(VLOOKUP(B45,$B$2:$K$51,10,0)+VLOOKUP(B45,ResultsA!$B$2:$F$51,5,FALSE),\"\")","v":""},"",""]
[45,null,null,null,null,"",{"$f":"IF($B46=\"\",\"\",(VLOOKUP($B46,Teams!$A$2:$C$51,2,FALSE)))","v":""},{"$f":"IF($B46=\"\",\"\",(VLOOKUP($B46,Teams!$A$2:$D$51,4,FALSE)))","v":""},"","",{"$f":"IFERROR(VLOOKUP(B46,$B$2:$F$51,5,0)-VLOOKUP(B46,ResultsA!$B$2:$M$51,12,0),\"\")","v":""},{"$f":"IFERROR(VLOOKUP(B46,$B$2:$K$51,10,0)+VLOOKUP(B46,ResultsA!$B$2:$F$51,5,FALSE),\"\")","v":""},"",""]
[46,null,null,null,null,"",{"$f":"IF($B47=\"\",\"\",(VLOOKUP($B47,Teams!$A$2:$C$51,2,FALSE)))","v":""},{"$f":"IF($B47=\"\",\"\",(VLOOKUP($B47,Teams!$A$2:$D$51,4,FALSE)))","v":""},"","",{"$f":"IFERROR(VLOOKUP(B47,$B$2:$F$51,5,0)-VLOOKUP(B47,ResultsA!$B$2:$M$51,12,0),\"\")","v":""},{"$f":"IFERROR(VLOOKUP(B47,$B$2:$K$51,10,0)+VLOOKUP(B47,ResultsA!$B$2:$F$51,5,FALSE),\"\")","v":""},"",""]
[47,null,null,null,null,"",{"$f":"IF($B48=\"\",\"\",(VLOOKUP($B48,Teams!$A$2:$C$51,2,FALSE)))","v":""},{"$f":"IF($B48=\"\",\"\",(VLOOKUP($B48,Teams!$A$2:$D$51,4,FALSE)))","v":""},"","",{"$f":"IFERROR(VLOOKUP(B48,$B$2:$F$51,5,0)-VLOOKUP(B48,ResultsA!$B$2:$M$51,12,0),\"\")","v":""},{"$f":"IFERROR(VLOOKUP(B48,$B$2:$K$51,10,0)+VLOOKUP(B48,ResultsA!$B$2:$F$51,5,FALSE),\"\")","v":""},"",""]
[48,null,null,null,null,"",{"$f":"IF($B49=\"\",\"\",(VLOOKUP($B49,Teams!$A$2:$C$51,2,FALSE)))","v":""},{"$f":"IF($B49=\"\",\"\",(VLOOKUP($B49,Teams!$A$2:$D$51,4,FALSE)))","v":""},"","",{"$f":"IFERROR(VLOOKUP(B49,$B$2:$F$51,5,0)-VLOOKUP(B49,ResultsA!$B$2:$M$51,12,0),\"\")","v":""},{"$f":"IFERROR(VLOOKUP(B49,$B$2:$K$51,10,0)+VLOOKUP(B49,ResultsA!$B$2:$F$51,5,FALSE),\"\")","v":""},"",""]
[49,null,null,null,null,"",{"$f":"IF($B50=\"\",\"\",(VLOOKUP($B50,Teams!$A$2:$C$51,2,FALSE)))","v":""},{"$f":"IF($B50=\"\",\"\",(VLOOKUP($B50,Teams!$A$2:$D$51,4,FALSE)))","v":""},"","",{"$f":"IFERROR(VLOOKUP(B50,$B$2:$F$51,5,0)-VLOOKUP(B50,ResultsA!$B$2:$M$51,12,0),\"\")","v":""},{"$f":"IFERROR(VLOOKUP(B50,$B$2:$K$51,10,0)+VLOOKUP(B50,ResultsA!$B$2:$F$51,5,FALSE),\"\")","v":""},"",""]
[50,null,null,null,null,"",{"$f":"IF($B51=\"\",\"\",(VLOOKUP($B51,Teams!$A$2:$C$51,2,FALSE)))","v":""},{"$f":"IF($B51=\"\",\"\",(VLOOKUP($B51,Teams!$A$2:$D$51,4,FALSE)))","v":""},"","",{"$f":"IFERROR(VLOOKUP(B51,$B$2:$F$51,5,0)-VLOOKUP(B51,ResultsA!$B$2:$M$51,12,0),\"\")","v":""},{"$f":"IFERROR(VLOOKUP(B51,$B$2:$K$51,10,0)+VLOOKUP(B51,ResultsA!$B$2:$F$51,5,FALSE),\"\")","v":""},"",""]

{"sheet":"HardCopy2","index":9,"n_rows":52,"n_cols":13,"rows_kept":52,"cut":false,"hidden":false,"merged":[[0,0,0,6],[0,8,0,12]]}
["TEAM TIMES",null,null,null,null,null,null,null,"LEG B TIMES"]
["Position","Number","ALT2","Club","M/F/X","Over MST","ACT2",null,"Position","Number","ALT2","Club","M/F/X"]
[1,31,"01:06:29","Bingley A Holes","Male","00:00:00","02:06:46",null,1,36,"01:03:29","Annie's Dream Team","Mixed"]
[2,36,"01:03:29","Annie's Dream Team","Mixed","00:00:00","02:07:41",null,2,31,"01:06:29","Bingley A Holes","Male"]
[3,52,"01:06:53","Keighley & Craven A ","Male","00:00:00","02:16:27",null,3,52,"01:06:53","Keighley & Craven A ","Male"]
[4,49,"01:17:27","Real Men Wear Pink","Mixed","00:00:00","02:21:24",null,4,38,"01:08:26","Kirkham MX","Mixed"]
[5,50,"01:13:45","Barlick 3 Belles","Female","00:00:00","02:26:35",null,5,35,"01:13:20","Skipton","Mixed"]
[6,37,"01:16:10","Doddy Superhero","Mixed","00:00:00","02:29:42",null,6,50,"01:13:45","Barlick 3 Belles","Female"]
[7,39,"01:19:42","St Nicks","Mixed","00:00:00","02:29:49",null,7,41,"01:14:57","Pudsey P Prancers","Male"]
[8,33,"01:20:20","Bingley C Rappers","Male","00:00:00","02:31:30",null,8,37,"01:16:10","Doddy Superhero","Mixed"]
[9,41,"01:14:57","Pudsey P Prancers","Male","00:00:00","02:34:33",null,9,44,"01:16:31","K & C Arsey Amblers","Female"]
[10,38,"01:08:26","Kirkham MX","Mixed","00:00:00","02:34:53",null,10,49,"01:17:27","Real Men Wear Pink","Mixed"]
[11,35,"01:13:20","Skipton","Mixed","00:00:00","02:35:27",null,11,48,"01:17:37","Rudolf Needs A Vet","Mixed"]
[12,53,"01:21:28","Keighley & Craven B","Male","00:00:00","02:35:39",null,12,55,"01:19:34","Bingley Angels","Female"]
[13,48,"01:17:37","Rudolf Needs A Vet","Mixed","00:00:00","02:35:49",null,13,39,"01:19:42","St Nicks","Mixed"]
[14,44,"01:16:31","K & C Arsey Amblers","Female","00:00:00","02:35:53",null,14,33,"01:20:20","Bingley C Rappers","Male"]
[15,32,"01:26:26","Bingley B Stards","Male","00:00:00","02:36:53",null,15,53,"01:21:28","Keighley & Craven B","Male"]
[16,55,"01:19:34","Bingley Angels","Female","00:00:00","02:38:26",null,16,54,"01:25:28","Keighley & Craven C","Male"]
[17,42,"01:32:19","Pudsey P Comets","Mixed","00:00:00","02:41:37",null,17,32,"01:26:26","Bingley B Stards","Male"]
[18,54,"01:25:28","Keighley & Craven C","Male","00:00:00","02:45:45",null,18,56,"01:29:06","Bingley Babes","Female"]
[19,40,"01:36:12","Pudsey P Vixens","Female","00:00:00","02:48:28",null,19,42,"01:32:19","Pudsey P Comets","Mixed"]
[20,56,"01:29:06","Bingley Babes","Female","00:00:00","02:51:06",null,20,40,"01:36:12","Pudsey P Vixens","Female"]
[21,34,"01:39:57","Cononley","Mixed","00:00:00","03:01:01",null,21,51,"01:37:59","Barlick 4","Female"]
[22,57,"01:47:43","Bingley Belles","Female","00:00:00","03:07:15",null,22,34,"01:39:57","Cononley","Mixed"]
[23,51,"01:37:59","Barlick 4","Female","00:00:00","03:10:15",null,23,43,"01:44:14","Pudsey P Dancers","Mixed"]
[24,43,"01:44:14","Pudsey P Dancers","Mixed","00:00:00","03:12:16",null,24,58,"01:44:52","Hail Marys","Female"]
[25,58,"01:44:52","Hail Marys","Female","00:00:00","03:14:10",null,25,57,"01:47:43","Bingley Belles","Female"]
[26,45,"01:52:34","K & C Bottom Bloomers!!","Female","00:08:22","03:23:22",null,26,46,"01:52:22","K & C Mega Munchers","Mixed"]
[27,46,"01:52:22","K & C Mega Munchers","Mixed","00:08:23","03:23:23",null,27,45,"01:52:34","K & C Bottom Bloomers!!","Female"]
[28,47,"02:04:18","K & C Marvellous Mincers!","Mixed","00:34:18","03:50:23",null,28,47,"02:04:18","K & C Marvellous Mincers!","Mixed"]
[29,null,"","","","","",null,29,null,"","",""]
[30,null,null,"","","","",null,30,null,"","",""]
[31,null,"","","","","",null,31,null,"","",""]
[32,null,"","","","","",null,32,null,"","",""]
[33,null,"","","","","",null,33,null,"","",""]
[34,null,"","","","","",null,34,null,"","",""]
[35,null,"","","","","",null,35,null,"","",""]
[36,null,"","","","","",null,36,null,"","",""]
[37,null,"","","","","",null,37,null,"","",""]
[38,null,"","","","","",null,38,null,"","",""]
[39,null,"","","","","",null,39,null,"","",""]
[40,null,"","","","","",null,40,null,"","",""]
[41,null,"","","","","",null,41,null,"","",""]
[42,null,"","","","","",null,42,null,"","",""]
[43,null,"","","","","",null,43,null,"","",""]
[44,null,"","","","","",null,44,null,"","",""]
[45,null,"","","","","",null,45,null,"","",""]
[46,null,"","","","","",null,46,null,"","",""]
[47,null,"","","","","",null,47,null,"","",""]
[48,null,"","","","","",null,48,null,"","",""]
[49,null,"","","","","",null,49,null,"","",""]
[50,null,"","","","","",null,50,null,null,"",""]

{"sheet":"ResultsC","index":10,"n_rows":51,"n_cols":15,"rows_kept":51,"cut":false,"hidden":true,"merged":[]}
["Position","Number","hours","mins","secs","Cuml Time","Club","M/F/X","MST Cuml3","Over MST","ALT3","ACT3","SOT3","LFP3","04:00:00"]
[1,31,2,42,20,{"$f":"IF(B2=\"\",\"\",TIME(C2,D2,E2))","v":"02:42:20"},{"$f":"IF($B2=\"\",\"\",(VLOOKUP($B2,Teams!$A$2:$C$51,2,FALSE)))","v":"Bingley A Holes"},{"$f":"IF($B2=\"\",\"\",(VLOOKUP($B2,Teams!$A$2:$D$51,4,FALSE)))","v":"Male"},{"$f":"IF(B2=\"\",\"\",$O$1)","v":"04:00:00"},{"$f":"IF(F2=\"\",\"\",IF((F2-I2)>0,F2-I2,0))","v":"00:00:00"},{"$f":"IFERROR(F2-VLOOKUP(B2,ResultsB!$B$2:$M$51,12,0),\"\")","v":"00:35:34"},{"$f":"IFERROR(F2+VLOOKUP(B2,ResultsB!$B$2:$J$51,9,0),\"\")","v":"02:42:20"},{"$f":"IF(F2<I2,F2,I2)","v":"02:42:20"},1]
[2,52,2,55,44,{"$f":"IF(B3=\"\",\"\",TIME(C3,D3,E3))","v":"02:55:44"},{"$f":"IF($B3=\"\",\"\",(VLOOKUP($B3,Teams!$A$2:$C$51,2,FALSE)))","v":"Keighley & Craven A "},{"$f":"IF($B3=\"\",\"\",(VLOOKUP($B3,Teams!$A$2:$D$51,4,FALSE)))","v":"Male"},"04:00:00","00:00:00",{"$f":"IFERROR(F3-VLOOKUP(B3,ResultsB!$B$2:$M$51,12,0),\"\")","v":"00:39:17"},{"$f":"IFERROR(F3+VLOOKUP(B3,ResultsB!$B$2:$J$51,9,0),\"\")","v":"02:55:44"},"02:55:44",2]
[3,36,3,1,2,"03:01:02",{"$f":"IF($B4=\"\",\"\",(VLOOKUP($B4,Teams!$A$2:$C$51,2,FALSE)))","v":"Annie's Dream Team"},{"$f":"IF($B4=\"\",\"\",(VLOOKUP($B4,Teams!$A$2:$D$51,4,FALSE)))","v":"Mixed"},"04:00:00","00:00:00",{"$f":"IFERROR(F4-VLOOKUP(B4,ResultsB!$B$2:$M$51,12,0),\"\")","v":"00:53:21"},{"$f":"IFERROR(F4+VLOOKUP(B4,ResultsB!$B$2:$J$51,9,0),\"\")","v":"03:01:02"},"03:01:02",3]
[4,49,3,1,43,"03:01:43",{"$f":"IF($B5=\"\",\"\",(VLOOKUP($B5,Teams!$A$2:$C$51,2,FALSE)))","v":"Real Men Wear Pink"},{"$f":"IF($B5=\"\",\"\",(VLOOKUP($B5,Teams!$A$2:$D$51,4,FALSE)))","v":"Mixed"},"04:00:00","00:00:00",{"$f":"IFERROR(F5-VLOOKUP(B5,ResultsB!$B$2:$M$51,12,0),\"\")","v":"00:40:19"},{"$f":"IFERROR(F5+VLOOKUP(B5,ResultsB!$B$2:$J$51,9,0),\"\")","v":"03:01:43"},"03:01:43",4]
[5,50,3,8,55,"03:08:55",{"$f":"IF($B6=\"\",\"\",(VLOOKUP($B6,Teams!$A$2:$C$51,2,FALSE)))","v":"Barlick 3 Belles"},{"$f":"IF($B6=\"\",\"\",(VLOOKUP($B6,Teams!$A$2:$D$51,4,FALSE)))","v":"Female"},"04:00:00","00:00:00",{"$f":"IFERROR(F6-VLOOKUP(B6,ResultsB!$B$2:$M$51,12,0),\"\")","v":"00:42:20"},{"$f":"IFERROR(F6+VLOOKUP(B6,ResultsB!$B$2:$J$51,9,0),\"\")","v":"03:08:55"},"03:08:55",5]
[6,48,3,16,16,"03:16:16",{"$f":"IF($B7=\"\",\"\",(VLOOKUP($B7,Teams!$A$2:$C$51,2,FALSE)))","v":"Rudolf Needs A Vet"},{"$f":"IF($B7=\"\",\"\",(VLOOKUP($B7,Teams!$A$2:$D$51,4,FALSE)))","v":"Mixed"},"04:00:00","00:00:00",{"$f":"IFERROR(F7-VLOOKUP(B7,ResultsB!$B$2:$M$51,12,0),\"\")","v":"00:40:27"},{"$f":"IFERROR(F7+VLOOKUP(B7,ResultsB!$B$2:$J$51,9,0),\"\")","v":"03:16:16"},"03:16:16",6]
[7,37,3,16,49,"03:16:49",{"$f":"IF($B8=\"\",\"\",(VLOOKUP($B8,Teams!$A$2:$C$51,2,FALSE)))","v":"Doddy Superhero"},{"$f":"IF($B8=\"\",\"\",(VLOOKUP($B8,Teams!$A$2:$D$51,4,FALSE)))","v":"Mixed"},"04:00:00","00:00:00",{"$f":"IFERROR(F8-VLOOKUP(B8,ResultsB!$B$2:$M$51,12,0),\"\")","v":"00:47:07"},{"$f":"IFERROR(F8+VLOOKUP(B8,ResultsB!$B$2:$J$51,9,0),\"\")","v":"03:16:49"},"03:16:49",7]
[8,32,3,17,53,"03:17:53",{"$f":"IF($B9=\"\",\"\",(VLOOKUP($B9,Teams!$A$2:$C$51,2,FALSE)))","v":"Bingley B Stards"},{"$f":"IF($B9=\"\",\"\",(VLOOKUP($B9,Teams!$A$2:$D$51,4,FALSE)))","v":"Male"},"04:00:00","00:00:00",{"$f":"IFERROR(F9-VLOOKUP(B9,ResultsB!$B$2:$M$51,12,0),\"\")","v":"00:41:00"},{"$f":"IFERROR(F9+VLOOKUP(B9,ResultsB!$B$2:$J$51,9,0),\"\")","v":"03:17:53"},"03:17:53",8]
[9,53,3,20,0,"03:20:00",{"$f":"IF($B10=\"\",\"\",(VLOOKUP($B10,Teams!$A$2:$C$51,2,FALSE)))","v":"Keighley & Craven B"},{"$f":"IF($B10=\"\",\"\",(VLOOKUP($B10,Teams!$A$2:$D$51,4,FALSE)))","v":"Male"},"04:00:00","00:00:00",{"$f":"IFERROR(F10-VLOOKUP(B10,ResultsB!$B$2:$M$51,12,0),\"\")","v":"00:44:21"},{"$f":"IFERROR(F10+VLOOKUP(B10,ResultsB!$B$2:$J$51,9,0),\"\")","v":"03:20:00"},"03:20:00",9]
[10,44,3,23,3,"03:23:03",{"$f":"IF($B11=\"\",\"\",(VLOOKUP($B11,Teams!$A$2:$C$51,2,FALSE)))","v":"K & C Arsey Amblers"},{"$f":"IF($B11=\"\",\"\",(VLOOKUP($B11,Teams!$A$2:$D$51,4,FALSE)))","v":"Female"},"04:00:00","00:00:00",{"$f":"IFERROR(F11-VLOOKUP(B11,ResultsB!$B$2:$M$51,12,0),\"\")","v":"00:47:10"},{"$f":"IFERROR(F11+VLOOKUP(B11,ResultsB!$B$2:$J$51,9,0),\"\")","v":"03:23:03"},"03:23:03",10]
[11,35,3,23,10,"03:23:10",{"$f":"IF($B12=\"\",\"\",(VLOOKUP($B12,Teams!$A$2:$C$51,2,FALSE)))","v":"Skipton"},{"$f":"IF($B12=\"\",\"\",(VLOOKUP($B12,Teams!$A$2:$D$51,4,FALSE)))","v":"Mixed"},"04:00:00","00:00:00",{"$f":"IFERROR(F12-VLOOKUP(B12,ResultsB!$B$2:$M$51,12,0),\"\")","v":"00:47:43"},{"$f":"IFERROR(F12+VLOOKUP(B12,ResultsB!$B$2:$J$51,9,0),\"\")","v":"03:23:10"},"03:23:10",11]
[12,38,3,23,20,"03:23:20",{"$f":"IF($B13=\"\",\"\",(VLOOKUP($B13,Teams!$A$2:$C$51,2,FALSE)))","v":"Kirkham MX"},{"$f":"IF($B13=\"\",\"\",(VLOOKUP($B13,Teams!$A$2:$D$51,4,FALSE)))","v":"Mixed"},"04:00:00","00:00:00",{"$f":"IFERROR(F13-VLOOKUP(B13,ResultsB!$B$2:$M$51,12,0),\"\")","v":"00:48:27"},{"$f":"IFERROR(F13+VLOOKUP(B13,ResultsB!$B$2:$J$51,9,0),\"\")","v":"03:23:20"},"03:23:20",12]
[13,39,3,23,48,"03:23:48",{"$f":"IF($B14=\"\",\"\",(VLOOKUP($B14,Teams!$A$2:$C$51,2,FALSE)))","v":"St Nicks"},{"$f":"IF($B14=\"\",\"\",(VLOOKUP($B14,Teams!$A$2:$D$51,4,FALSE)))","v":"Mixed"},"04:00:00","00:00:00",{"$f":"IFERROR(F14-VLOOKUP(B14,ResultsB!$B$2:$M$51,12,0),\"\")","v":"00:53:59"},{"$f":"IFERROR(F14+VLOOKUP(B14,ResultsB!$B$2:$J$51,9,0),\"\")","v":"03:23:48"},"03:23:48",13]
[14,41,3,24,46,"03:24:46",{"$f":"IF($B15=\"\",\"\",(VLOOKUP($B15,Teams!$A$2:$C$51,2,FALSE)))","v":"Pudsey P Prancers"},{"$f":"IF($B15=\"\",\"\",(VLOOKUP($B15,Teams!$A$2:$D$51,4,FALSE)))","v":"Male"},"04:00:00","00:00:00",{"$f":"IFERROR(F15-VLOOKUP(B15,ResultsB!$B$2:$M$51,12,0),\"\")","v":"00:50:13"},{"$f":"IFERROR(F15+VLOOKUP(B15,ResultsB!$B$2:$J$51,9,0),\"\")","v":"03:24:46"},"03:24:46",14]
[15,55,3,26,46,"03:26:46",{"$f":"IF($B16=\"\",\"\",(VLOOKUP($B16,Teams!$A$2:$C$51,2,FALSE)))","v":"Bingley Angels"},{"$f":"IF($B16=\"\",\"\",(VLOOKUP($B16,Teams!$A$2:$D$51,4,FALSE)))","v":"Female"},"04:00:00","00:00:00",{"$f":"IFERROR(F16-VLOOKUP(B16,ResultsB!$B$2:$M$51,12,0),\"\")","v":"00:48:20"},{"$f":"IFERROR(F16+VLOOKUP(B16,ResultsB!$B$2:$J$51,9,0),\"\")","v":"03:26:46"},"03:26:46",15]
[16,33,3,31,2,"03:31:02",{"$f":"IF($B17=\"\",\"\",(VLOOKUP($B17,Teams!$A$2:$C$51,2,FALSE)))","v":"Bingley C Rappers"},{"$f":"IF($B17=\"\",\"\",(VLOOKUP($B17,Teams!$A$2:$D$51,4,FALSE)))","v":"Male"},"04:00:00","00:00:00",{"$f":"IFERROR(F17-VLOOKUP(B17,ResultsB!$B$2:$M$51,12,0),\"\")","v":"00:59:32"},{"$f":"IFERROR(F17+VLOOKUP(B17,ResultsB!$B$2:$J$51,9,0),\"\")","v":"03:31:02"},"03:31:02",16]
[17,54,3,35,25,"03:35:25",{"$f":"IF($B18=\"\",\"\",(VLOOKUP($B18,Teams!$A$2:$C$51,2,FALSE)))","v":"Keighley & Craven C"},{"$f":"IF($B18=\"\",\"\",(VLOOKUP($B18,Teams!$A$2:$D$51,4,FALSE)))","v":"Male"},"04:00:00","00:00:00",{"$f":"IFERROR(F18-VLOOKUP(B18,ResultsB!$B$2:$M$51,12,0),\"\")","v":"00:49:40"},{"$f":"IFERROR(F18+VLOOKUP(B18,ResultsB!$B$2:$J$51,9,0),\"\")","v":"03:35:25"},"03:35:25",17]
[18,56,3,38,25,"03:38:25",{"$f":"IF($B19=\"\",\"\",(VLOOKUP($B19,Teams!$A$2:$C$51,2,FALSE)))","v":"Bingley Babes"},{"$f":"IF($B19=\"\",\"\",(VLOOKUP($B19,Teams!$A$2:$D$51,4,FALSE)))","v":"Female"},"04:00:00","00:00:00",{"$f":"IFERROR(F19-VLOOKUP(B19,ResultsB!$B$2:$M$51,12,0),\"\")","v":"00:47:19"},{"$f":"IFERROR(F19+VLOOKUP(B19,ResultsB!$B$2:$J$51,9,0),\"\")","v":"03:38:25"},"03:38:25",18]
[19,42,3,40,34,"03:40:34",{"$f":"IF($B20=\"\",\"\",(VLOOKUP($B20,Teams!$A$2:$C$51,2,FALSE)))","v":"Pudsey P Comets"},{"$f":"IF($B20=\"\",\"\",(VLOOKUP($B20,Teams!$A$2:$D$51,4,FALSE)))","v":"Mixed"},"04:00:00","00:00:00",{"$f":"IFERROR(F20-VLOOKUP(B20,ResultsB!$B$2:$M$51,12,0),\"\")","v":"00:58:57"},{"$f":"IFERROR(F20+VLOOKUP(B20,ResultsB!$B$2:$J$51,9,0),\"\")","v":"03:40:34"},"03:40:34",19]
[20,40,3,51,42,"03:51:42",{"$f":"IF($B21=\"\",\"\",(VLOOKUP($B21,Teams!$A$2:$C$51,2,FALSE)))","v":"Pudsey P Vixens"},{"$f":"IF($B21=\"\",\"\",(VLOOKUP($B21,Teams!$A$2:$D$51,4,FALSE)))","v":"Female"},"04:00:00","00:00:00",{"$f":"IFERROR(F21-VLOOKUP(B21,ResultsB!$B$2:$M$51,12,0),\"\")","v":"01:03:14"},{"$f":"IFERROR(F21+VLOOKUP(B21,ResultsB!$B$2:$J$51,9,0),\"\")","v":"03:51:42"},"03:51:42",20]
[21,57,4,2,30,"04:02:30",{"$f":"IF($B22=\"\",\"\",(VLOOKUP($B22,Teams!$A$2:$C$51,2,FALSE)))","v":"Bingley Belles"},{"$f":"IF($B22=\"\",\"\",(VLOOKUP($B22,Teams!$A$2:$D$51,4,FALSE)))","v":"Female"},"04:00:00","00:02:30",{"$f":"IFERROR(F22-VLOOKUP(B22,ResultsB!$B$2:$M$51,12,0),\"\")","v":"00:55:15"},{"$f":"IFERROR(F22+VLOOKUP(B22,ResultsB!$B$2:$J$51,9,0),\"\")","v":"04:02:30"},"04:00:00",21]
[22,43,4,2,45,{"$f":"IF(B23=\"\",\"\",TIME(C23,D23,E23))","v":"04:02:45"},{"$f":"IF($B23=\"\",\"\",(VLOOKUP($B23,Teams!$A$2:$C$51,2,FALSE)))","v":"Pudsey P Dancers"},{"$f":"IF($B23=\"\",\"\",(VLOOKUP($B23,Teams!$A$2:$D$51,4,FALSE)))","v":"Mixed"},"04:00:00","00:02:45",{"$f":"IFERROR(F23-VLOOKUP(B23,ResultsB!$B$2:$M$51,12,0),\"\")","v":"00:50:29"},{"$f":"IFERROR(F23+VLOOKUP(B23,ResultsB!$B$2:$J$51,9,0),\"\")","v":"04:02:45"},"04:00:00",22]
[23,34,4,2,55,"04:02:55",{"$f":"IF($B24=\"\",\"\",(VLOOKUP($B24,Teams!$A$2:$C$51,2,FALSE)))","v":"Cononley"},{"$f":"IF($B24=\"\",\"\",(VLOOKUP($B24,Teams!$A$2:$D$51,4,FALSE)))","v":"Mixed"},"04:00:00","00:02:55",{"$f":"IFERROR(F24-VLOOKUP(B24,ResultsB!$B$2:$M$51,12,0),\"\")","v":"01:01:54"},{"$f":"IFERROR(F24+VLOOKUP(B24,ResultsB!$B$2:$J$51,9,0),\"\")","v":"04:02:55"},"04:00:00",23]
[24,58,4,5,36,"04:05:36",{"$f":"IF($B25=\"\",\"\",(VLOOKUP($B25,Teams!$A$2:$C$51,2,FALSE)))","v":"Hail Marys"},{"$f":"IF($B25=\"\",\"\",(VLOOKUP($B25,Teams!$A$2:$D$51,4,FALSE)))","v":"Female"},"04:00:00","00:05:36",{"$f":"IFERROR(F25-VLOOKUP(B25,ResultsB!$B$2:$M$51,12,0),\"\")","v":"00:51:26"},{"$f":"IFERROR(F25+VLOOKUP(B25,ResultsB!$B$2:$J$51,9,0),\"\")","v":"04:05:36"},"04:00:00",24]
[25,46,4,6,18,"04:06:18",{"$f":"IF($B26=\"\",\"\",(VLOOKUP($B26,Teams!$A$2:$C$51,2,FALSE)))","v":"K & C Mega Munchers"},{"$f":"IF($B26=\"\",\"\",(VLOOKUP($B26,Teams!$A$2:$D$51,4,FALSE)))","v":"Mixed"},"04:00:00","00:06:18",{"$f":"IFERROR(F26-VLOOKUP(B26,ResultsB!$B$2:$M$51,12,0),\"\")","v":"00:51:18"},{"$f":"IFERROR(F26+VLOOKUP(B26,ResultsB!$B$2:$J$51,9,0),\"\")","v":"04:14:41"},"04:00:00",25]
[26,45,4,11,1,"04:11:01",{"$f":"IF($B27=\"\",\"\",(VLOOKUP($B27,Teams!$A$2:$C$51,2,FALSE)))","v":"K & C Bottom Bloomers!!"},{"$f":"IF($B27=\"\",\"\",(VLOOKUP($B27,Teams!$A$2:$D$51,4,FALSE)))","v":"Female"},"04:00:00","00:11:01",{"$f":"IFERROR(F27-VLOOKUP(B27,ResultsB!$B$2:$M$51,12,0),\"\")","v":"00:56:01"},{"$f":"IFERROR(F27+VLOOKUP(B27,ResultsB!$B$2:$J$51,9,0),\"\")","v":"04:19:23"},"04:00:00",26]
[27,51,4,12,44,"04:12:44",{"$f":"IF($B28=\"\",\"\",(VLOOKUP($B28,Teams!$A$2:$C$51,2,FALSE)))","v":"Barlick 4"},{"$f":"IF($B28=\"\",\"\",(VLOOKUP($B28,Teams!$A$2:$D$51,4,FALSE)))","v":"Female"},"04:00:00","00:12:44",{"$f":"IFERROR(F28-VLOOKUP(B28,ResultsB!$B$2:$M$51,12,0),\"\")","v":"01:02:29"},{"$f":"IFERROR(F28+VLOOKUP(B28,ResultsB!$B$2:$J$51,9,0),\"\")","v":"04:12:44"},"04:00:00",27]
[28,47,4,27,23,{"$f":"IF(B29=\"\",\"\",TIME(C29,D29,E29))","v":"04:27:23"},{"$f":"IF($B29=\"\",\"\",(VLOOKUP($B29,Teams!$A$2:$C$51,2,FALSE)))","v":"K & C Marvellous Mincers!"},{"$f":"IF($B29=\"\",\"\",(VLOOKUP($B29,Teams!$A$2:$D$51,4,FALSE)))","v":"Mixed"},{"$f":"IF(B29=\"\",\"\",$O$1)","v":"04:00:00"},{"$f":"IF(F29=\"\",\"\",IF((F29-I29)>0,F29-I29,0))","v":"00:27:23"},{"$f":"IFERROR(F29-VLOOKUP(B29,ResultsB!$B$2:$M$51,12,0),\"\")","v":"01:12:23"},{"$f":"IFERROR(F29+VLOOKUP(B29,ResultsB!$B$2:$J$51,9,0),\"\")","v":"05:01:41"},{"$f":"IF(F29<I29,F29,I29)","v":"04:00:00"},28]
[29,null,null,null,null,"",{"$f":"IF($B30=\"\",\"\",(VLOOKUP($B30,Teams!$A$2:$C$51,2,FALSE)))","v":""},{"$f":"IF($B30=\"\",\"\",(VLOOKUP($B30,Teams!$A$2:$D$51,4,FALSE)))","v":""},"","",{"$f":"IFERROR(F30-VLOOKUP(B30,ResultsB!$B$2:$M$51,12,0),\"\")","v":""},{"$f":"IFERROR(F30+VLOOKUP(B30,ResultsB!$B$2:$J$51,9,0),\"\")","v":""},"",29]
[30,null,null,null,null,"",{"$f":"IF($B31=\"\",\"\",(VLOOKUP($B31,Teams!$A$2:$C$51,2,FALSE)))","v":""},{"$f":"IF($B31=\"\",\"\",(VLOOKUP($B31,Teams!$A$2:$D$51,4,FALSE)))","v":""},"",null,{"$f":"IFERROR(F31-VLOOKUP(B31,ResultsB!$B$2:$M$51,12,0),\"\")","v":""},{"$f":"IFERROR(F31+VLOOKUP(B31,ResultsB!$B$2:$J$51,9,0),\"\")","v":""},"",30]
[31,null,null,null,null,"",{"$f":"IF($B32=\"\",\"\",(VLOOKUP($B32,Teams!$A$2:$C$51,2,FALSE)))","v":""},{"$f":"IF($B32=\"\",\"\",(VLOOKUP($B32,Teams!$A$2:$D$51,4,FALSE)))","v":""},"","",null,{"$f":"IFERROR(F32+VLOOKUP(B32,ResultsB!$B$2:$J$51,9,0),\"\")","v":""},"",31]
[32,null,null,null,null,"",{"$f":"IF($B33=\"\",\"\",(VLOOKUP($B33,Teams!$A$2:$C$51,2,FALSE)))","v":""},{"$f":"IF($B33=\"\",\"\",(VLOOKUP($B33,Teams!$A$2:$D$51,4,FALSE)))","v":""},"","",{"$f":"IFERROR(F33-VLOOKUP(B33,ResultsB!$B$2:$M$51,12,0),\"\")","v":""},{"$f":"IFERROR(F33+VLOOKUP(B33,ResultsB!$B$2:$J$51,9,0),\"\")","v":""},"",32]
[33,null,null,null,null,"",{"$f":"IF($B34=\"\",\"\",(VLOOKUP($B34,Teams!$A$2:$C$51,2,FALSE)))","v":""},{"$f":"IF($B34=\"\",\"\",(VLOOKUP($B34,Teams!$A$2:$D$51,4,FALSE)))","v":""},"","",{"$f":"IFERROR(F34-VLOOKUP(B34,ResultsB!$B$2:$M$51,12,0),\"\")","v":""},{"$f":"IFERROR(F34+VLOOKUP(B34,ResultsB!$B$2:$J$51,9,0),\"\")","v":""},"",33]
[34,null,null,null,null,"",{"$f":"IF($B35=\"\",\"\",(VLOOKUP($B35,Teams!$A$2:$C$51,2,FALSE)))","v":""},{"$f":"IF($B35=\"\",\"\",(VLOOKUP($B35,Teams!$A$2:$D$51,4,FALSE)))","v":""},"","",{"$f":"IFERROR(F35-VLOOKUP(B35,ResultsB!$B$2:$M$51,12,0),\"\")","v":""},{"$f":"IFERROR(F35+VLOOKUP(B35,ResultsB!$B$2:$J$51,9,0),\"\")","v":""},"",34]
[35,null,null,null,null,"",{"$f":"IF($B36=\"\",\"\",(VLOOKUP($B36,Teams!$A$2:$C$51,2,FALSE)))","v":""},{"$f":"IF($B36=\"\",\"\",(VLOOKUP($B36,Teams!$A$2:$D$51,4,FALSE)))","v":""},"","",{"$f":"IFERROR(F36-VLOOKUP(B36,ResultsB!$B$2:$M$51,12,0),\"\")","v":""},{"$f":"IFERROR(F36+VLOOKUP(B36,ResultsB!$B$2:$J$51,9,0),\"\")","v":""},"",35]
[36,null,null,null,null,"",{"$f":"IF($B37=\"\",\"\",(VLOOKUP($B37,Teams!$A$2:$C$51,2,FALSE)))","v":""},{"$f":"IF($B37=\"\",\"\",(VLOOKUP($B37,Teams!$A$2:$D$51,4,FALSE)))","v":""},"","",{"$f":"IFERROR(F37-VLOOKUP(B37,ResultsB!$B$2:$M$51,12,0),\"\")","v":""},{"$f":"IFERROR(F37+VLOOKUP(B37,ResultsB!$B$2:$J$51,9,0),\"\")","v":""},"",36]
[37,null,null,null,null,"",{"$f":"IF($B38=\"\",\"\",(VLOOKUP($B38,Teams!$A$2:$C$51,2,FALSE)))","v":""},{"$f":"IF($B38=\"\",\"\",(VLOOKUP($B38,Teams!$A$2:$D$51,4,FALSE)))","v":""},"","",{"$f":"IFERROR(F38-VLOOKUP(B38,ResultsB!$B$2:$M$51,12,0),\"\")","v":""},{"$f":"IFERROR(F38+VLOOKUP(B38,ResultsB!$B$2:$J$51,9,0),\"\")","v":""},"",37]
[38,null,null,null,null,"",{"$f":"IF($B39=\"\",\"\",(VLOOKUP($B39,Teams!$A$2:$C$51,2,FALSE)))","v":""},{"$f":"IF($B39=\"\",\"\",(VLOOKUP($B39,Teams!$A$2:$D$51,4,FALSE)))","v":""},"","",{"$f":"IFERROR(F39-VLOOKUP(B39,ResultsB!$B$2:$M$51,12,0),\"\")","v":""},{"$f":"IFERROR(F39+VLOOKUP(B39,ResultsB!$B$2:$J$51,9,0),\"\")","v":""},"",38]
[39,null,null,null,null,"",{"$f":"IF($B40=\"\",\"\",(VLOOKUP($B40,Teams!$A$2:$C$51,2,FALSE)))","v":""},{"$f":"IF($B40=\"\",\"\",(VLOOKUP($B40,Teams!$A$2:$D$51,4,FALSE)))","v":""},"","",{"$f":"IFERROR(F40-VLOOKUP(B40,ResultsB!$B$2:$M$51,12,0),\"\")","v":""},{"$f":"IFERROR(F40+VLOOKUP(B40,ResultsB!$B$2:$J$51,9,0),\"\")","v":""},"",39]
[40,null,null,null,null,"",{"$f":"IF($B41=\"\",\"\",(VLOOKUP($B41,Teams!$A$2:$C$51,2,FALSE)))","v":""},{"$f":"IF($B41=\"\",\"\",(VLOOKUP($B41,Teams!$A$2:$D$51,4,FALSE)))","v":""},"","",{"$f":"IFERROR(F41-VLOOKUP(B41,ResultsB!$B$2:$M$51,12,0),\"\")","v":""},{"$f":"IFERROR(F41+VLOOKUP(B41,ResultsB!$B$2:$J$51,9,0),\"\")","v":""},"",40]
[41,null,null,null,null,"",{"$f":"IF($B42=\"\",\"\",(VLOOKUP($B42,Teams!$A$2:$C$51,2,FALSE)))","v":""},{"$f":"IF($B42=\"\",\"\",(VLOOKUP($B42,Teams!$A$2:$D$51,4,FALSE)))","v":""},"","",{"$f":"IFERROR(F42-VLOOKUP(B42,ResultsB!$B$2:$M$51,12,0),\"\")","v":""},{"$f":"IFERROR(F42+VLOOKUP(B42,ResultsB!$B$2:$J$51,9,0),\"\")","v":""},"",41]
[42,null,null,null,null,"",{"$f":"IF($B43=\"\",\"\",(VLOOKUP($B43,Teams!$A$2:$C$51,2,FALSE)))","v":""},{"$f":"IF($B43=\"\",\"\",(VLOOKUP($B43,Teams!$A$2:$D$51,4,FALSE)))","v":""},"","",{"$f":"IFERROR(F43-VLOOKUP(B43,ResultsB!$B$2:$M$51,12,0),\"\")","v":""},{"$f":"IFERROR(F43+VLOOKUP(B43,ResultsB!$B$2:$J$51,9,0),\"\")","v":""},"",42]
[43,null,null,null,null,"",{"$f":"IF($B44=\"\",\"\",(VLOOKUP($B44,Teams!$A$2:$C$51,2,FALSE)))","v":""},{"$f":"IF($B44=\"\",\"\",(VLOOKUP($B44,Teams!$A$2:$D$51,4,FALSE)))","v":""},"","",{"$f":"IFERROR(F44-VLOOKUP(B44,ResultsB!$B$2:$M$51,12,0),\"\")","v":""},{"$f":"IFERROR(F44+VLOOKUP(B44,ResultsB!$B$2:$J$51,9,0),\"\")","v":""},"",43]
[44,null,null,null,null,"",{"$f":"IF($B45=\"\",\"\",(VLOOKUP($B45,Teams!$A$2:$C$51,2,FALSE)))","v":""},{"$f":"IF($B45=\"\",\"\",(VLOOKUP($B45,Teams!$A$2:$D$51,4,FALSE)))","v":""},"","",{"$f":"IFERROR(F45-VLOOKUP(B45,ResultsB!$B$2:$M$51,12,0),\"\")","v":""},{"$f":"IFERROR(F45+VLOOKUP(B45,ResultsB!$B$2:$J$51,9,0),\"\")","v":""},"",44]
[45,null,null,null,null,"",{"$f":"IF($B46=\"\",\"\",(VLOOKUP($B46,Teams!$A$2:$C$51,2,FALSE)))","v":""},{"$f":"IF($B46=\"\",\"\",(VLOOKUP($B46,Teams!$A$2:$D$51,4,FALSE)))","v":""},"","",{"$f":"IFERROR(F46-VLOOKUP(B46,ResultsB!$B$2:$M$51,12,0),\"\")","v":""},{"$f":"IFERROR(F46+VLOOKUP(B46,ResultsB!$B$2:$J$51,9,0),\"\")","v":""},"",45]
[46,null,null,null,null,"",{"$f":"IF($B47=\"\",\"\",(VLOOKUP($B47,Teams!$A$2:$C$51,2,FALSE)))","v":""},{"$f":"IF($B47=\"\",\"\",(VLOOKUP($B47,Teams!$A$2:$D$51,4,FALSE)))","v":""},"","",{"$f":"IFERROR(F47-VLOOKUP(B47,ResultsB!$B$2:$M$51,12,0),\"\")","v":""},{"$f":"IFERROR(F47+VLOOKUP(B47,ResultsB!$B$2:$J$51,9,0),\"\")","v":""},"",46]
[47,null,null,null,null,"",{"$f":"IF($B48=\"\",\"\",(VLOOKUP($B48,Teams!$A$2:$C$51,2,FALSE)))","v":""},{"$f":"IF($B48=\"\",\"\",(VLOOKUP($B48,Teams!$A$2:$D$51,4,FALSE)))","v":""},"","",{"$f":"IFERROR(F48-VLOOKUP(B48,ResultsB!$B$2:$M$51,12,0),\"\")","v":""},{"$f":"IFERROR(F48+VLOOKUP(B48,ResultsB!$B$2:$J$51,9,0),\"\")","v":""},"",47]
[48,null,null,null,null,"",{"$f":"IF($B49=\"\",\"\",(VLOOKUP($B49,Teams!$A$2:$C$51,2,FALSE)))","v":""},{"$f":"IF($B49=\"\",\"\",(VLOOKUP($B49,Teams!$A$2:$D$51,4,FALSE)))","v":""},"","",{"$f":"IFERROR(F49-VLOOKUP(B49,ResultsB!$B$2:$M$51,12,0),\"\")","v":""},{"$f":"IFERROR(F49+VLOOKUP(B49,ResultsB!$B$2:$J$51,9,0),\"\")","v":""},"",48]
[49,null,null,null,null,"",{"$f":"IF($B50=\"\",\"\",(VLOOKUP($B50,Teams!$A$2:$C$51,2,FALSE)))","v":""},{"$f":"IF($B50=\"\",\"\",(VLOOKUP($B50,Teams!$A$2:$D$51,4,FALSE)))","v":""},"","",{"$f":"IFERROR(F50-VLOOKUP(B50,ResultsB!$B$2:$M$51,12,0),\"\")","v":""},{"$f":"IFERROR(F50+VLOOKUP(B50,ResultsB!$B$2:$J$51,9,0),\"\")","v":""},"",49]
[50,null,null,null,null,"",{"$f":"IF($B51=\"\",\"\",(VLOOKUP($B51,Teams!$A$2:$C$51,2,FALSE)))","v":""},{"$f":"IF($B51=\"\",\"\",(VLOOKUP($B51,Teams!$A$2:$D$51,4,FALSE)))","v":""},"","",{"$f":"IFERROR(F51-VLOOKUP(B51,ResultsB!$B$2:$M$51,12,0),\"\")","v":""},{"$f":"IFERROR(F51+VLOOKUP(B51,ResultsB!$B$2:$J$51,9,0),\"\")","v":""},"",50]

{"sheet":"HardCopy3","index":11,"n_rows":52,"n_cols":13,"rows_kept":52,"cut":false,"hidden":false,"merged":[[0,0,0,6],[0,8,0,12]]}
["TEAM TIMES",null,null,null,null,null,null,null,"LEG C TIMES"]
["Position","Number","ALT3","Club","M/F/X","Over MST","ACT3",null,"Position","Number","ALT3","Club","M/F/X"]
[1,31,"00:35:34","Bingley A Holes","Male","00:00:00","02:42:20",null,1,31,"00:35:34","Bingley A Holes","Male"]
[2,52,"00:39:17","Keighley & Craven A ","Male","00:00:00","02:55:44",null,2,52,"00:39:17","Keighley & Craven A ","Male"]
[3,36,"00:53:21","Annie's Dream Team","Mixed","00:00:00","03:01:02",null,3,49,"00:40:19","Real Men Wear Pink","Mixed"]
[4,49,"00:40:19","Real Men Wear Pink","Mixed","00:00:00","03:01:43",null,4,48,"00:40:27","Rudolf Needs A Vet","Mixed"]
[5,50,"00:42:20","Barlick 3 Belles","Female","00:00:00","03:08:55",null,5,32,"00:41:00","Bingley B Stards","Male"]
[6,48,"00:40:27","Rudolf Needs A Vet","Mixed","00:00:00","03:16:16",null,6,50,"00:42:20","Barlick 3 Belles","Female"]
[7,37,"00:47:07","Doddy Superhero","Mixed","00:00:00","03:16:49",null,7,53,"00:44:21","Keighley & Craven B","Male"]
[8,32,"00:41:00","Bingley B Stards","Male","00:00:00","03:17:53",null,8,37,"00:47:07","Doddy Superhero","Mixed"]
[9,53,"00:44:21","Keighley & Craven B","Male","00:00:00","03:20:00",null,9,44,"00:47:10","K & C Arsey Amblers","Female"]
[10,44,"00:47:10","K & C Arsey Amblers","Female","00:00:00","03:23:03",null,10,56,"00:47:19","Bingley Babes","Female"]
[11,35,"00:47:43","Skipton","Mixed","00:00:00","03:23:10",null,11,35,"00:47:43","Skipton","Mixed"]
[12,38,"00:48:27","Kirkham MX","Mixed","00:00:00","03:23:20",null,12,55,"00:48:20","Bingley Angels","Female"]
[13,39,"00:53:59","St Nicks","Mixed","00:00:00","03:23:48",null,13,38,"00:48:27","Kirkham MX","Mixed"]
[14,41,"00:50:13","Pudsey P Prancers","Male","00:00:00","03:24:46",null,14,54,"00:49:40","Keighley & Craven C","Male"]
[15,55,"00:48:20","Bingley Angels","Female","00:00:00","03:26:46",null,15,41,"00:50:13","Pudsey P Prancers","Male"]
[16,33,"00:59:32","Bingley C Rappers","Male","00:00:00","03:31:02",null,16,43,"00:50:29","Pudsey P Dancers","Mixed"]
[17,54,"00:49:40","Keighley & Craven C","Male","00:00:00","03:35:25",null,17,46,"00:51:18","K & C Mega Munchers","Mixed"]
[18,56,"00:47:19","Bingley Babes","Female","00:00:00","03:38:25",null,18,58,"00:51:26","Hail Marys","Female"]
[19,42,"00:58:57","Pudsey P Comets","Mixed","00:00:00","03:40:34",null,19,36,"00:53:21","Annie's Dream Team","Mixed"]
[20,40,"01:03:14","Pudsey P Vixens","Female","00:00:00","03:51:42",null,20,39,"00:53:59","St Nicks","Mixed"]
[21,57,"00:55:15","Bingley Belles","Female","00:02:30","04:02:30",null,21,57,"00:55:15","Bingley Belles","Female"]
[22,43,"00:50:29","Pudsey P Dancers","Mixed","00:02:45","04:02:45",null,22,45,"00:56:01","K & C Bottom Bloomers!!","Female"]
[23,34,"01:01:54","Cononley","Mixed","00:02:55","04:02:55",null,23,42,"00:58:57","Pudsey P Comets","Mixed"]
[24,58,"00:51:26","Hail Marys","Female","00:05:36","04:05:36",null,24,33,"00:59:32","Bingley C Rappers","Male"]
[25,46,"00:51:18","K & C Mega Munchers","Mixed","00:06:18","04:14:41",null,25,34,"01:01:54","Cononley","Mixed"]
[26,45,"00:56:01","K & C Bottom Bloomers!!","Female","00:11:01","04:19:23",null,26,51,"01:02:29","Barlick 4","Female"]
[27,51,"01:02:29","Barlick 4","Female","00:12:44","04:12:44",null,27,40,"01:03:14","Pudsey P Vixens","Female"]
[28,47,"01:12:23","K & C Marvellous Mincers!","Mixed","00:27:23","05:01:41",null,28,47,"01:12:23","K & C Marvellous Mincers!","Mixed"]
[29,null,"","","","","",null,29,null,"","",""]
[30,null,"","","",null,"",null,30,null,"","",""]
[31,null,null,"","","","",null,31,null,"","",""]
[32,null,"","","","","",null,32,null,"","",""]
[33,null,"","","","","",null,33,null,"","",""]
[34,null,"","","","","",null,34,null,"","",""]
[35,null,"","","","","",null,35,null,"","",""]
[36,null,"","","","","",null,36,null,"","",""]
[37,null,"","","","","",null,37,null,"","",""]
[38,null,"","","","","",null,38,null,"","",""]
[39,null,"","","","","",null,39,null,"","",""]
[40,null,"","","","","",null,40,null,"","",""]
[41,null,"","","","","",null,41,null,"","",""]
[42,null,"","","","","",null,42,null,"","",""]
[43,null,"","","","","",null,43,null,"","",""]
[44,null,"","","","","",null,44,null,"","",""]
[45,null,"","","","","",null,45,null,"","",""]
[46,null,"","","","","",null,46,null,"","",""]
[47,null,"","","","","",null,47,null,"","",""]
[48,null,"","","","","",null,48,null,"","",""]
[49,null,"","","","","",null,49,null,"","",""]
[50,null,"","","","","",null,50,null,null,"",""]

{"sheet":"ResultsD","index":12,"n_rows":51,"n_cols":10,"rows_kept":51,"cut":false,"hidden":true,"merged":[]}
["Position","Number","hours","mins","secs","Cuml Time","Club","M/F/X","ALT4","ACT4"]
[1,31,3,30,49,{"$f":"IF(B2=\"\",\"\",TIME(C2,D2,E2))","v":"03:30:49"},{"$f":"IF($B2=\"\",\"\",(VLOOKUP($B2,Teams!$A$2:$C$51,2,FALSE)))","v":"Bingley A Holes"},{"$f":"IF($B2=\"\",\"\",(VLOOKUP($B2,Teams!$A$2:$D$51,4,FALSE)))","v":"Male"},{"$f":"IFERROR(F2-VLOOKUP(B2,ResultsC!$B$2:$M$51,12,0),\"\")","v":"00:48:29"},{"$f":"IFERROR(I2+VLOOKUP(B2,ResultsC!$B$2:$J$51,9,0)+VLOOKUP(B2,ResultsC!$B$2:$K$51,10,0)+VLOOKUP(B2,ResultsB!$B$2:$J$51,9,0)+VLOOKUP(B2,ResultsB!$B$2:$K$51,10,0)+VLOOKUP(B2,ResultsA!$B$2:$K$51,10,0),\"\")","v":"03:30:49"}]
[2,52,3,46,14,"03:46:14",{"$f":"IF($B3=\"\",\"\",(VLOOKUP($B3,Teams!$A$2:$C$51,2,FALSE)))","v":"Keighley & Craven A "},{"$f":"IF($B3=\"\",\"\",(VLOOKUP($B3,Teams!$A$2:$D$51,4,FALSE)))","v":"Male"},{"$f":"IFERROR(F3-VLOOKUP(B3,ResultsC!$B$2:$M$51,12,0),\"\")","v":"00:50:30"},{"$f":"IFERROR(I3+VLOOKUP(B3,ResultsC!$B$2:$J$51,9,0)+VLOOKUP(B3,ResultsC!$B$2:$K$51,10,0)+VLOOKUP(B3,ResultsB!$B$2:$J$51,9,0)+VLOOKUP(B3,ResultsB!$B$2:$K$51,10,0)+VLOOKUP(B3,ResultsA!$B$2:$K$51,10,0),\"\")","v":"03:46:14"}]
[3,36,4,0,9,"04:00:09",{"$f":"IF($B4=\"\",\"\",(VLOOKUP($B4,Teams!$A$2:$C$51,2,FALSE)))","v":"Annie's Dream Team"},{"$f":"IF($B4=\"\",\"\",(VLOOKUP($B4,Teams!$A$2:$D$51,4,FALSE)))","v":"Mixed"},{"$f":"IFERROR(F4-VLOOKUP(B4,ResultsC!$B$2:$M$51,12,0),\"\")","v":"00:59:07"},{"$f":"IFERROR(I4+VLOOKUP(B4,ResultsC!$B$2:$J$51,9,0)+VLOOKUP(B4,ResultsC!$B$2:$K$51,10,0)+VLOOKUP(B4,ResultsB!$B$2:$J$51,9,0)+VLOOKUP(B4,ResultsB!$B$2:$K$51,10,0)+VLOOKUP(B4,ResultsA!$B$2:$K$51,10,0),\"\")","v":"04:00:09"}]
[4,48,4,5,15,"04:05:15",{"$f":"IF($B5=\"\",\"\",(VLOOKUP($B5,Teams!$A$2:$C$51,2,FALSE)))","v":"Rudolf Needs A Vet"},{"$f":"IF($B5=\"\",\"\",(VLOOKUP($B5,Teams!$A$2:$D$51,4,FALSE)))","v":"Mixed"},{"$f":"IFERROR(F5-VLOOKUP(B5,ResultsC!$B$2:$M$51,12,0),\"\")","v":"00:48:59"},{"$f":"IFERROR(I5+VLOOKUP(B5,ResultsC!$B$2:$J$51,9,0)+VLOOKUP(B5,ResultsC!$B$2:$K$51,10,0)+VLOOKUP(B5,ResultsB!$B$2:$J$51,9,0)+VLOOKUP(B5,ResultsB!$B$2:$K$51,10,0)+VLOOKUP(B5,ResultsA!$B$2:$K$51,10,0),\"\")","v":"04:05:15"}]
[5,32,4,7,17,"04:07:17",{"$f":"IF($B6=\"\",\"\",(VLOOKUP($B6,Teams!$A$2:$C$51,2,FALSE)))","v":"Bingley B Stards"},{"$f":"IF($B6=\"\",\"\",(VLOOKUP($B6,Teams!$A$2:$D$51,4,FALSE)))","v":"Male"},{"$f":"IFERROR(F6-VLOOKUP(B6,ResultsC!$B$2:$M$51,12,0),\"\")","v":"00:49:24"},{"$f":"IFERROR(I6+VLOOKUP(B6,ResultsC!$B$2:$J$51,9,0)+VLOOKUP(B6,ResultsC!$B$2:$K$51,10,0)+VLOOKUP(B6,ResultsB!$B$2:$J$51,9,0)+VLOOKUP(B6,ResultsB!$B$2:$K$51,10,0)+VLOOKUP(B6,ResultsA!$B$2:$K$51,10,0),\"\")","v":"04:07:17"}]
[6,49,4,11,18,"04:11:18",{"$f":"IF($B7=\"\",\"\",(VLOOKUP($B7,Teams!$A$2:$C$51,2,FALSE)))","v":"Real Men Wear Pink"},{"$f":"IF($B7=\"\",\"\",(VLOOKUP($B7,Teams!$A$2:$D$51,4,FALSE)))","v":"Mixed"},{"$f":"IFERROR(F7-VLOOKUP(B7,ResultsC!$B$2:$M$51,12,0),\"\")","v":"01:09:35"},{"$f":"IFERROR(I7+VLOOKUP(B7,ResultsC!$B$2:$J$51,9,0)+VLOOKUP(B7,ResultsC!$B$2:$K$51,10,0)+VLOOKUP(B7,ResultsB!$B$2:$J$51,9,0)+VLOOKUP(B7,ResultsB!$B$2:$K$51,10,0)+VLOOKUP(B7,ResultsA!$B$2:$K$51,10,0),\"\")","v":"04:11:18"}]
[7,50,4,11,29,"04:11:29",{"$f":"IF($B8=\"\",\"\",(VLOOKUP($B8,Teams!$A$2:$C$51,2,FALSE)))","v":"Barlick 3 Belles"},{"$f":"IF($B8=\"\",\"\",(VLOOKUP($B8,Teams!$A$2:$D$51,4,FALSE)))","v":"Female"},{"$f":"IFERROR(F8-VLOOKUP(B8,ResultsC!$B$2:$M$51,12,0),\"\")","v":"01:02:34"},{"$f":"IFERROR(I8+VLOOKUP(B8,ResultsC!$B$2:$J$51,9,0)+VLOOKUP(B8,ResultsC!$B$2:$K$51,10,0)+VLOOKUP(B8,ResultsB!$B$2:$J$51,9,0)+VLOOKUP(B8,ResultsB!$B$2:$K$51,10,0)+VLOOKUP(B8,ResultsA!$B$2:$K$51,10,0),\"\")","v":"04:11:29"}]
[8,53,4,14,6,"04:14:06",{"$f":"IF($B9=\"\",\"\",(VLOOKUP($B9,Teams!$A$2:$C$51,2,FALSE)))","v":"Keighley & Craven B"},{"$f":"IF($B9=\"\",\"\",(VLOOKUP($B9,Teams!$A$2:$D$51,4,FALSE)))","v":"Male"},{"$f":"IFERROR(F9-VLOOKUP(B9,ResultsC!$B$2:$M$51,12,0),\"\")","v":"00:54:06"},{"$f":"IFERROR(I9+VLOOKUP(B9,ResultsC!$B$2:$J$51,9,0)+VLOOKUP(B9,ResultsC!$B$2:$K$51,10,0)+VLOOKUP(B9,ResultsB!$B$2:$J$51,9,0)+VLOOKUP(B9,ResultsB!$B$2:$K$51,10,0)+VLOOKUP(B9,ResultsA!$B$2:$K$51,10,0),\"\")","v":"04:14:06"}]
[9,37,4,18,28,"04:18:28",{"$f":"IF($B10=\"\",\"\",(VLOOKUP($B10,Teams!$A$2:$C$51,2,FALSE)))","v":"Doddy Superhero"},{"$f":"IF($B10=\"\",\"\",(VLOOKUP($B10,Teams!$A$2:$D$51,4,FALSE)))","v":"Mixed"},{"$f":"IFERROR(F10-VLOOKUP(B10,ResultsC!$B$2:$M$51,12,0),\"\")","v":"01:01:39"},{"$f":"IFERROR(I10+VLOOKUP(B10,ResultsC!$B$2:$J$51,9,0)+VLOOKUP(B10,ResultsC!$B$2:$K$51,10,0)+VLOOKUP(B10,ResultsB!$B$2:$J$51,9,0)+VLOOKUP(B10,ResultsB!$B$2:$K$51,10,0)+VLOOKUP(B10,ResultsA!$B$2:$K$51,10,0),\"\")","v":"04:18:28"}]
[10,39,4,21,30,"04:21:30",{"$f":"IF($B11=\"\",\"\",(VLOOKUP($B11,Teams!$A$2:$C$51,2,FALSE)))","v":"St Nicks"},{"$f":"IF($B11=\"\",\"\",(VLOOKUP($B11,Teams!$A$2:$D$51,4,FALSE)))","v":"Mixed"},{"$f":"IFERROR(F11-VLOOKUP(B11,ResultsC!$B$2:$M$51,12,0),\"\")","v":"00:57:42"},{"$f":"IFERROR(I11+VLOOKUP(B11,ResultsC!$B$2:$J$51,9,0)+VLOOKUP(B11,ResultsC!$B$2:$K$51,10,0)+VLOOKUP(B11,ResultsB!$B$2:$J$51,9,0)+VLOOKUP(B11,ResultsB!$B$2:$K$51,10,0)+VLOOKUP(B11,ResultsA!$B$2:$K$51,10,0),\"\")","v":"04:21:30"}]
[11,55,4,25,34,"04:25:34",{"$f":"IF($B12=\"\",\"\",(VLOOKUP($B12,Teams!$A$2:$C$51,2,FALSE)))","v":"Bingley Angels"},{"$f":"IF($B12=\"\",\"\",(VLOOKUP($B12,Teams!$A$2:$D$51,4,FALSE)))","v":"Female"},{"$f":"IFERROR(F12-VLOOKUP(B12,ResultsC!$B$2:$M$51,12,0),\"\")","v":"00:58:48"},{"$f":"IFERROR(I12+VLOOKUP(B12,ResultsC!$B$2:$J$51,9,0)+VLOOKUP(B12,ResultsC!$B$2:$K$51,10,0)+VLOOKUP(B12,ResultsB!$B$2:$J$51,9,0)+VLOOKUP(B12,ResultsB!$B$2:$K$51,10,0)+VLOOKUP(B12,ResultsA!$B$2:$K$51,10,0),\"\")","v":"04:25:34"}]
[12,35,4,26,54,"04:26:54",{"$f":"IF($B13=\"\",\"\",(VLOOKUP($B13,Teams!$A$2:$C$51,2,FALSE)))","v":"Skipton"},{"$f":"IF($B13=\"\",\"\",(VLOOKUP($B13,Teams!$A$2:$D$51,4,FALSE)))","v":"Mixed"},{"$f":"IFERROR(F13-VLOOKUP(B13,ResultsC!$B$2:$M$51,12,0),\"\")","v":"01:03:44"},{"$f":"IFERROR(I13+VLOOKUP(B13,ResultsC!$B$2:$J$51,9,0)+VLOOKUP(B13,ResultsC!$B$2:$K$51,10,0)+VLOOKUP(B13,ResultsB!$B$2:$J$51,9,0)+VLOOKUP(B13,ResultsB!$B$2:$K$51,10,0)+VLOOKUP(B13,ResultsA!$B$2:$K$51,10,0),\"\")","v":"04:26:54"}]
[13,44,4,27,10,"04:27:10",{"$f":"IF($B14=\"\",\"\",(VLOOKUP($B14,Teams!$A$2:$C$51,2,FALSE)))","v":"K & C Arsey Amblers"},{"$f":"IF($B14=\"\",\"\",(VLOOKUP($B14,Teams!$A$2:$D$51,4,FALSE)))","v":"Female"},{"$f":"IFERROR(F14-VLOOKUP(B14,ResultsC!$B$2:$M$51,12,0),\"\")","v":"01:04:07"},{"$f":"IFERROR(I14+VLOOKUP(B14,ResultsC!$B$2:$J$51,9,0)+VLOOKUP(B14,ResultsC!$B$2:$K$51,10,0)+VLOOKUP(B14,ResultsB!$B$2:$J$51,9,0)+VLOOKUP(B14,ResultsB!$B$2:$K$51,10,0)+VLOOKUP(B14,ResultsA!$B$2:$K$51,10,0),\"\")","v":"04:27:10"}]
[14,38,4,27,19,"04:27:19",{"$f":"IF($B15=\"\",\"\",(VLOOKUP($B15,Teams!$A$2:$C$51,2,FALSE)))","v":"Kirkham MX"},{"$f":"IF($B15=\"\",\"\",(VLOOKUP($B15,Teams!$A$2:$D$51,4,FALSE)))","v":"Mixed"},{"$f":"IFERROR(F15-VLOOKUP(B15,ResultsC!$B$2:$M$51,12,0),\"\")","v":"01:03:59"},{"$f":"IFERROR(I15+VLOOKUP(B15,ResultsC!$B$2:$J$51,9,0)+VLOOKUP(B15,ResultsC!$B$2:$K$51,10,0)+VLOOKUP(B15,ResultsB!$B$2:$J$51,9,0)+VLOOKUP(B15,ResultsB!$B$2:$K$51,10,0)+VLOOKUP(B15,ResultsA!$B$2:$K$51,10,0),\"\")","v":"04:27:19"}]
[15,33,4,27,27,"04:27:27",{"$f":"IF($B16=\"\",\"\",(VLOOKUP($B16,Teams!$A$2:$C$51,2,FALSE)))","v":"Bingley C Rappers"},{"$f":"IF($B16=\"\",\"\",(VLOOKUP($B16,Teams!$A$2:$D$51,4,FALSE)))","v":"Male"},{"$f":"IFERROR(F16-VLOOKUP(B16,ResultsC!$B$2:$M$51,12,0),\"\")","v":"00:56:25"},{"$f":"IFERROR(I16+VLOOKUP(B16,ResultsC!$B$2:$J$51,9,0)+VLOOKUP(B16,ResultsC!$B$2:$K$51,10,0)+VLOOKUP(B16,ResultsB!$B$2:$J$51,9,0)+VLOOKUP(B16,ResultsB!$B$2:$K$51,10,0)+VLOOKUP(B16,ResultsA!$B$2:$K$51,10,0),\"\")","v":"04:27:27"}]
[16,54,4,36,23,"04:36:23",{"$f":"IF($B17=\"\",\"\",(VLOOKUP($B17,Teams!$A$2:$C$51,2,FALSE)))","v":"Keighley & Craven C"},{"$f":"IF($B17=\"\",\"\",(VLOOKUP($B17,Teams!$A$2:$D$51,4,FALSE)))","v":"Male"},{"$f":"IFERROR(F17-VLOOKUP(B17,ResultsC!$B$2:$M$51,12,0),\"\")","v":"01:00:58"},{"$f":"IFERROR(I17+VLOOKUP(B17,ResultsC!$B$2:$J$51,9,0)+VLOOKUP(B17,ResultsC!$B$2:$K$51,10,0)+VLOOKUP(B17,ResultsB!$B$2:$J$51,9,0)+VLOOKUP(B17,ResultsB!$B$2:$K$51,10,0)+VLOOKUP(B17,ResultsA!$B$2:$K$51,10,0),\"\")","v":"04:36:23"}]
[17,56,4,41,20,"04:41:20",{"$f":"IF($B18=\"\",\"\",(VLOOKUP($B18,Teams!$A$2:$C$51,2,FALSE)))","v":"Bingley Babes"},{"$f":"IF($B18=\"\",\"\",(VLOOKUP($B18,Teams!$A$2:$D$51,4,FALSE)))","v":"Female"},{"$f":"IFERROR(F18-VLOOKUP(B18,ResultsC!$B$2:$M$51,12,0),\"\")","v":"01:02:55"},{"$f":"IFERROR(I18+VLOOKUP(B18,ResultsC!$B$2:$J$51,9,0)+VLOOKUP(B18,ResultsC!$B$2:$K$51,10,0)+VLOOKUP(B18,ResultsB!$B$2:$J$51,9,0)+VLOOKUP(B18,ResultsB!$B$2:$K$51,10,0)+VLOOKUP(B18,ResultsA!$B$2:$K$51,10,0),\"\")","v":"04:41:20"}]
[18,41,4,42,24,"04:42:24",{"$f":"IF($B19=\"\",\"\",(VLOOKUP($B19,Teams!$A$2:$C$51,2,FALSE)))","v":"Pudsey P Prancers"},{"$f":"IF($B19=\"\",\"\",(VLOOKUP($B19,Teams!$A$2:$D$51,4,FALSE)))","v":"Male"},{"$f":"IFERROR(F19-VLOOKUP(B19,ResultsC!$B$2:$M$51,12,0),\"\")","v":"01:17:38"},{"$f":"IFERROR(I19+VLOOKUP(B19,ResultsC!$B$2:$J$51,9,0)+VLOOKUP(B19,ResultsC!$B$2:$K$51,10,0)+VLOOKUP(B19,ResultsB!$B$2:$J$51,9,0)+VLOOKUP(B19,ResultsB!$B$2:$K$51,10,0)+VLOOKUP(B19,ResultsA!$B$2:$K$51,10,0),\"\")","v":"04:42:24"}]
[21,40,5,4,38,"05:04:38",{"$f":"IF($B20=\"\",\"\",(VLOOKUP($B20,Teams!$A$2:$C$51,2,FALSE)))","v":"Pudsey P Vixens"},{"$f":"IF($B20=\"\",\"\",(VLOOKUP($B20,Teams!$A$2:$D$51,4,FALSE)))","v":"Female"},{"$f":"IFERROR(F20-VLOOKUP(B20,ResultsC!$B$2:$M$51,12,0),\"\")","v":"01:12:56"},{"$f":"IFERROR(I20+VLOOKUP(B20,ResultsC!$B$2:$J$51,9,0)+VLOOKUP(B20,ResultsC!$B$2:$K$51,10,0)+VLOOKUP(B20,ResultsB!$B$2:$J$51,9,0)+VLOOKUP(B20,ResultsB!$B$2:$K$51,10,0)+VLOOKUP(B20,ResultsA!$B$2:$K$51,10,0),\"\")","v":"05:04:38"}]
[19,43,5,1,5,"05:01:05",{"$f":"IF($B21=\"\",\"\",(VLOOKUP($B21,Teams!$A$2:$C$51,2,FALSE)))","v":"Pudsey P Dancers"},{"$f":"IF($B21=\"\",\"\",(VLOOKUP($B21,Teams!$A$2:$D$51,4,FALSE)))","v":"Mixed"},{"$f":"IFERROR(F21-VLOOKUP(B21,ResultsC!$B$2:$M$51,12,0),\"\")","v":"01:01:05"},{"$f":"IFERROR(I21+VLOOKUP(B21,ResultsC!$B$2:$J$51,9,0)+VLOOKUP(B21,ResultsC!$B$2:$K$51,10,0)+VLOOKUP(B21,ResultsB!$B$2:$J$51,9,0)+VLOOKUP(B21,ResultsB!$B$2:$K$51,10,0)+VLOOKUP(B21,ResultsA!$B$2:$K$51,10,0),\"\")","v":"05:06:35"}]
[22,42,5,7,32,"05:07:32",{"$f":"IF($B22=\"\",\"\",(VLOOKUP($B22,Teams!$A$2:$C$51,2,FALSE)))","v":"Pudsey P Comets"},{"$f":"IF($B22=\"\",\"\",(VLOOKUP($B22,Teams!$A$2:$D$51,4,FALSE)))","v":"Mixed"},{"$f":"IFERROR(F22-VLOOKUP(B22,ResultsC!$B$2:$M$51,12,0),\"\")","v":"01:26:58"},{"$f":"IFERROR(I22+VLOOKUP(B22,ResultsC!$B$2:$J$51,9,0)+VLOOKUP(B22,ResultsC!$B$2:$K$51,10,0)+VLOOKUP(B22,ResultsB!$B$2:$J$51,9,0)+VLOOKUP(B22,ResultsB!$B$2:$K$51,10,0)+VLOOKUP(B22,ResultsA!$B$2:$K$51,10,0),\"\")","v":"05:07:32"}]
[26,57,5,14,48,"05:14:48",{"$f":"IF($B23=\"\",\"\",(VLOOKUP($B23,Teams!$A$2:$C$51,2,FALSE)))","v":"Bingley Belles"},{"$f":"IF($B23=\"\",\"\",(VLOOKUP($B23,Teams!$A$2:$D$51,4,FALSE)))","v":"Female"},{"$f":"IFERROR(F23-VLOOKUP(B23,ResultsC!$B$2:$M$51,12,0),\"\")","v":"01:14:48"},{"$f":"IFERROR(I23+VLOOKUP(B23,ResultsC!$B$2:$J$51,9,0)+VLOOKUP(B23,ResultsC!$B$2:$K$51,10,0)+VLOOKUP(B23,ResultsB!$B$2:$J$51,9,0)+VLOOKUP(B23,ResultsB!$B$2:$K$51,10,0)+VLOOKUP(B23,ResultsA!$B$2:$K$51,10,0),\"\")","v":"05:19:48"}]
[25,34,5,14,32,"05:14:32",{"$f":"IF($B24=\"\",\"\",(VLOOKUP($B24,Teams!$A$2:$C$51,2,FALSE)))","v":"Cononley"},{"$f":"IF($B24=\"\",\"\",(VLOOKUP($B24,Teams!$A$2:$D$51,4,FALSE)))","v":"Mixed"},{"$f":"IFERROR(F24-VLOOKUP(B24,ResultsC!$B$2:$M$51,12,0),\"\")","v":"01:14:32"},{"$f":"IFERROR(I24+VLOOKUP(B24,ResultsC!$B$2:$J$51,9,0)+VLOOKUP(B24,ResultsC!$B$2:$K$51,10,0)+VLOOKUP(B24,ResultsB!$B$2:$J$51,9,0)+VLOOKUP(B24,ResultsB!$B$2:$K$51,10,0)+VLOOKUP(B24,ResultsA!$B$2:$K$51,10,0),\"\")","v":"05:20:22"}]
[24,58,5,9,58,"05:09:58",{"$f":"IF($B25=\"\",\"\",(VLOOKUP($B25,Teams!$A$2:$C$51,2,FALSE)))","v":"Hail Marys"},{"$f":"IF($B25=\"\",\"\",(VLOOKUP($B25,Teams!$A$2:$D$51,4,FALSE)))","v":"Female"},{"$f":"IFERROR(F25-VLOOKUP(B25,ResultsC!$B$2:$M$51,12,0),\"\")","v":"01:09:58"},{"$f":"IFERROR(I25+VLOOKUP(B25,ResultsC!$B$2:$J$51,9,0)+VLOOKUP(B25,ResultsC!$B$2:$K$51,10,0)+VLOOKUP(B25,ResultsB!$B$2:$J$51,9,0)+VLOOKUP(B25,ResultsB!$B$2:$K$51,10,0)+VLOOKUP(B25,ResultsA!$B$2:$K$51,10,0),\"\")","v":"05:21:10"}]
[20,46,5,3,30,"05:03:30",{"$f":"IF($B26=\"\",\"\",(VLOOKUP($B26,Teams!$A$2:$C$51,2,FALSE)))","v":"K & C Mega Munchers"},{"$f":"IF($B26=\"\",\"\",(VLOOKUP($B26,Teams!$A$2:$D$51,4,FALSE)))","v":"Mixed"},{"$f":"IFERROR(F26-VLOOKUP(B26,ResultsC!$B$2:$M$51,12,0),\"\")","v":"01:03:30"},{"$f":"IFERROR(I26+VLOOKUP(B26,ResultsC!$B$2:$J$51,9,0)+VLOOKUP(B26,ResultsC!$B$2:$K$51,10,0)+VLOOKUP(B26,ResultsB!$B$2:$J$51,9,0)+VLOOKUP(B26,ResultsB!$B$2:$K$51,10,0)+VLOOKUP(B26,ResultsA!$B$2:$K$51,10,0),\"\")","v":"05:32:52"}]
[28,51,5,20,31,"05:20:31",{"$f":"IF($B27=\"\",\"\",(VLOOKUP($B27,Teams!$A$2:$C$51,2,FALSE)))","v":"Barlick 4"},{"$f":"IF($B27=\"\",\"\",(VLOOKUP($B27,Teams!$A$2:$D$51,4,FALSE)))","v":"Female"},{"$f":"IFERROR(F27-VLOOKUP(B27,ResultsC!$B$2:$M$51,12,0),\"\")","v":"01:20:31"},{"$f":"IFERROR(I27+VLOOKUP(B27,ResultsC!$B$2:$J$51,9,0)+VLOOKUP(B27,ResultsC!$B$2:$K$51,10,0)+VLOOKUP(B27,ResultsB!$B$2:$J$51,9,0)+VLOOKUP(B27,ResultsB!$B$2:$K$51,10,0)+VLOOKUP(B27,ResultsA!$B$2:$K$51,10,0),\"\")","v":"05:45:59"}]
[23,45,5,8,50,"05:08:50",{"$f":"IF($B28=\"\",\"\",(VLOOKUP($B28,Teams!$A$2:$C$51,2,FALSE)))","v":"K & C Bottom Bloomers!!"},{"$f":"IF($B28=\"\",\"\",(VLOOKUP($B28,Teams!$A$2:$D$51,4,FALSE)))","v":"Female"},{"$f":"IFERROR(F28-VLOOKUP(B28,ResultsC!$B$2:$M$51,12,0),\"\")","v":"01:08:50"},{"$f":"IFERROR(I28+VLOOKUP(B28,ResultsC!$B$2:$J$51,9,0)+VLOOKUP(B28,ResultsC!$B$2:$K$51,10,0)+VLOOKUP(B28,ResultsB!$B$2:$J$51,9,0)+VLOOKUP(B28,ResultsB!$B$2:$K$51,10,0)+VLOOKUP(B28,ResultsA!$B$2:$K$51,10,0),\"\")","v":"05:47:36"}]
[27,47,5,15,38,"05:15:38",{"$f":"IF($B29=\"\",\"\",(VLOOKUP($B29,Teams!$A$2:$C$51,2,FALSE)))","v":"K & C Marvellous Mincers!"},{"$f":"IF($B29=\"\",\"\",(VLOOKUP($B29,Teams!$A$2:$D$51,4,FALSE)))","v":"Mixed"},{"$f":"IFERROR(F29-VLOOKUP(B29,ResultsC!$B$2:$M$51,12,0),\"\")","v":"01:15:38"},{"$f":"IFERROR(I29+VLOOKUP(B29,ResultsC!$B$2:$J$51,9,0)+VLOOKUP(B29,ResultsC!$B$2:$K$51,10,0)+VLOOKUP(B29,ResultsB!$B$2:$J$51,9,0)+VLOOKUP(B29,ResultsB!$B$2:$K$51,10,0)+VLOOKUP(B29,ResultsA!$B$2:$K$51,10,0),\"\")","v":"07:20:05"}]
[29,null,null,null,null,"",{"$f":"IF($B30=\"\",\"\",(VLOOKUP($B30,Teams!$A$2:$C$51,2,FALSE)))","v":""},{"$f":"IF($B30=\"\",\"\",(VLOOKUP($B30,Teams!$A$2:$D$51,4,FALSE)))","v":""},{"$f":"IFERROR(F30-VLOOKUP(B30,ResultsC!$B$2:$M$51,12,0),\"\")","v":""},{"$f":"IFERROR(I30+VLOOKUP(B30,ResultsC!$B$2:$J$51,9,0)+VLOOKUP(B30,ResultsC!$B$2:$K$51,10,0)+VLOOKUP(B30,ResultsB!$B$2:$J$51,9,0)+VLOOKUP(B30,ResultsB!$B$2:$K$51,10,0)+VLOOKUP(B30,ResultsA!$B$2:$K$51,10,0),\"\")","v":""}]
[30,null,null,null,null,"",{"$f":"IF($B31=\"\",\"\",(VLOOKUP($B31,Teams!$A$2:$C$51,2,FALSE)))","v":""},{"$f":"IF($B31=\"\",\"\",(VLOOKUP($B31,Teams!$A$2:$D$51,4,FALSE)))","v":""},{"$f":"IFERROR(F31-VLOOKUP(B31,ResultsC!$B$2:$M$51,12,0),\"\")","v":""},{"$f":"IFERROR(I31+VLOOKUP(B31,ResultsC!$B$2:$J$51,9,0)+VLOOKUP(B31,ResultsC!$B$2:$K$51,10,0)+VLOOKUP(B31,ResultsB!$B$2:$J$51,9,0)+VLOOKUP(B31,ResultsB!$B$2:$K$51,10,0)+VLOOKUP(B31,ResultsA!$B$2:$K$51,10,0),\"\")","v":""}]
[31,null,null,null,null,"",{"$f":"IF($B32=\"\",\"\",(VLOOKUP($B32,Teams!$A$2:$C$51,2,FALSE)))","v":""},{"$f":"IF($B32=\"\",\"\",(VLOOKUP($B32,Teams!$A$2:$D$51,4,FALSE)))","v":""},{"$f":"IFERROR(F32-VLOOKUP(B32,ResultsC!$B$2:$M$51,12,0),\"\")","v":""},{"$f":"IFERROR(I32+VLOOKUP(B32,ResultsC!$B$2:$J$51,9,0)+VLOOKUP(B32,ResultsC!$B$2:$K$51,10,0)+VLOOKUP(B32,ResultsB!$B$2:$J$51,9,0)+VLOOKUP(B32,ResultsB!$B$2:$K$51,10,0)+VLOOKUP(B32,ResultsA!$B$2:$K$51,10,0),\"\")","v":""}]
[32,null,null,null,null,"",{"$f":"IF($B33=\"\",\"\",(VLOOKUP($B33,Teams!$A$2:$C$51,2,FALSE)))","v":""},{"$f":"IF($B33=\"\",\"\",(VLOOKUP($B33,Teams!$A$2:$D$51,4,FALSE)))","v":""},{"$f":"IFERROR(F33-VLOOKUP(B33,ResultsC!$B$2:$M$51,12,0),\"\")","v":""},{"$f":"IFERROR(I33+VLOOKUP(B33,ResultsC!$B$2:$J$51,9,0)+VLOOKUP(B33,ResultsC!$B$2:$K$51,10,0)+VLOOKUP(B33,ResultsB!$B$2:$J$51,9,0)+VLOOKUP(B33,ResultsB!$B$2:$K$51,10,0)+VLOOKUP(B33,ResultsA!$B$2:$K$51,10,0),\"\")","v":""}]
[33,null,null,null,null,{"$f":"IF(B34=\"\",\"\",TIME(C34,D34,E34))","v":""},{"$f":"IF($B34=\"\",\"\",(VLOOKUP($B34,Teams!$A$2:$C$51,2,FALSE)))","v":""},{"$f":"IF($B34=\"\",\"\",(VLOOKUP($B34,Teams!$A$2:$D$51,4,FALSE)))","v":""},{"$f":"IFERROR(F34-VLOOKUP(B34,ResultsC!$B$2:$M$51,12,0),\"\")","v":""},{"$f":"IFERROR(I34+VLOOKUP(B34,ResultsC!$B$2:$J$51,9,0)+VLOOKUP(B34,ResultsC!$B$2:$K$51,10,0)+VLOOKUP(B34,ResultsB!$B$2:$J$51,9,0)+VLOOKUP(B34,ResultsB!$B$2:$K$51,10,0)+VLOOKUP(B34,ResultsA!$B$2:$K$51,10,0),\"\")","v":""}]
[34,null,null,null,null,"",{"$f":"IF($B35=\"\",\"\",(VLOOKUP($B35,Teams!$A$2:$C$51,2,FALSE)))","v":""},{"$f":"IF($B35=\"\",\"\",(VLOOKUP($B35,Teams!$A$2:$D$51,4,FALSE)))","v":""},{"$f":"IFERROR(F35-VLOOKUP(B35,ResultsC!$B$2:$M$51,12,0),\"\")","v":""},{"$f":"IFERROR(I35+VLOOKUP(B35,ResultsC!$B$2:$J$51,9,0)+VLOOKUP(B35,ResultsC!$B$2:$K$51,10,0)+VLOOKUP(B35,ResultsB!$B$2:$J$51,9,0)+VLOOKUP(B35,ResultsB!$B$2:$K$51,10,0)+VLOOKUP(B35,ResultsA!$B$2:$K$51,10,0),\"\")","v":""}]
[35,null,null,null,null,"",{"$f":"IF($B36=\"\",\"\",(VLOOKUP($B36,Teams!$A$2:$C$51,2,FALSE)))","v":""},{"$f":"IF($B36=\"\",\"\",(VLOOKUP($B36,Teams!$A$2:$D$51,4,FALSE)))","v":""},{"$f":"IFERROR(F36-VLOOKUP(B36,ResultsC!$B$2:$M$51,12,0),\"\")","v":""},{"$f":"IFERROR(I36+VLOOKUP(B36,ResultsC!$B$2:$J$51,9,0)+VLOOKUP(B36,ResultsC!$B$2:$K$51,10,0)+VLOOKUP(B36,ResultsB!$B$2:$J$51,9,0)+VLOOKUP(B36,ResultsB!$B$2:$K$51,10,0)+VLOOKUP(B36,ResultsA!$B$2:$K$51,10,0),\"\")","v":""}]
[36,null,null,null,null,"",{"$f":"IF($B37=\"\",\"\",(VLOOKUP($B37,Teams!$A$2:$C$51,2,FALSE)))","v":""},{"$f":"IF($B37=\"\",\"\",(VLOOKUP($B37,Teams!$A$2:$D$51,4,FALSE)))","v":""},{"$f":"IFERROR(F37-VLOOKUP(B37,ResultsC!$B$2:$M$51,12,0),\"\")","v":""},{"$f":"IFERROR(I37+VLOOKUP(B37,ResultsC!$B$2:$J$51,9,0)+VLOOKUP(B37,ResultsC!$B$2:$K$51,10,0)+VLOOKUP(B37,ResultsB!$B$2:$J$51,9,0)+VLOOKUP(B37,ResultsB!$B$2:$K$51,10,0)+VLOOKUP(B37,ResultsA!$B$2:$K$51,10,0),\"\")","v":""}]
[37,null,null,null,null,"",{"$f":"IF($B38=\"\",\"\",(VLOOKUP($B38,Teams!$A$2:$C$51,2,FALSE)))","v":""},{"$f":"IF($B38=\"\",\"\",(VLOOKUP($B38,Teams!$A$2:$D$51,4,FALSE)))","v":""},{"$f":"IFERROR(F38-VLOOKUP(B38,ResultsC!$B$2:$M$51,12,0),\"\")","v":""},{"$f":"IFERROR(I38+VLOOKUP(B38,ResultsC!$B$2:$J$51,9,0)+VLOOKUP(B38,ResultsC!$B$2:$K$51,10,0)+VLOOKUP(B38,ResultsB!$B$2:$J$51,9,0)+VLOOKUP(B38,ResultsB!$B$2:$K$51,10,0)+VLOOKUP(B38,ResultsA!$B$2:$K$51,10,0),\"\")","v":""}]
[38,null,null,null,null,"",{"$f":"IF($B39=\"\",\"\",(VLOOKUP($B39,Teams!$A$2:$C$51,2,FALSE)))","v":""},{"$f":"IF($B39=\"\",\"\",(VLOOKUP($B39,Teams!$A$2:$D$51,4,FALSE)))","v":""},{"$f":"IFERROR(F39-VLOOKUP(B39,ResultsC!$B$2:$M$51,12,0),\"\")","v":""},{"$f":"IFERROR(I39+VLOOKUP(B39,ResultsC!$B$2:$J$51,9,0)+VLOOKUP(B39,ResultsC!$B$2:$K$51,10,0)+VLOOKUP(B39,ResultsB!$B$2:$J$51,9,0)+VLOOKUP(B39,ResultsB!$B$2:$K$51,10,0)+VLOOKUP(B39,ResultsA!$B$2:$K$51,10,0),\"\")","v":""}]
[39,null,null,null,null,"",{"$f":"IF($B40=\"\",\"\",(VLOOKUP($B40,Teams!$A$2:$C$51,2,FALSE)))","v":""},{"$f":"IF($B40=\"\",\"\",(VLOOKUP($B40,Teams!$A$2:$D$51,4,FALSE)))","v":""},{"$f":"IFERROR(F40-VLOOKUP(B40,ResultsC!$B$2:$M$51,12,0),\"\")","v":""},{"$f":"IFERROR(I40+VLOOKUP(B40,ResultsC!$B$2:$J$51,9,0)+VLOOKUP(B40,ResultsC!$B$2:$K$51,10,0)+VLOOKUP(B40,ResultsB!$B$2:$J$51,9,0)+VLOOKUP(B40,ResultsB!$B$2:$K$51,10,0)+VLOOKUP(B40,ResultsA!$B$2:$K$51,10,0),\"\")","v":""}]
[40,null,null,null,null,"",{"$f":"IF($B41=\"\",\"\",(VLOOKUP($B41,Teams!$A$2:$C$51,2,FALSE)))","v":""},{"$f":"IF($B41=\"\",\"\",(VLOOKUP($B41,Teams!$A$2:$D$51,4,FALSE)))","v":""},{"$f":"IFERROR(F41-VLOOKUP(B41,ResultsC!$B$2:$M$51,12,0),\"\")","v":""},{"$f":"IFERROR(I41+VLOOKUP(B41,ResultsC!$B$2:$J$51,9,0)+VLOOKUP(B41,ResultsC!$B$2:$K$51,10,0)+VLOOKUP(B41,ResultsB!$B$2:$J$51,9,0)+VLOOKUP(B41,ResultsB!$B$2:$K$51,10,0)+VLOOKUP(B41,ResultsA!$B$2:$K$51,10,0),\"\")","v":""}]
[41,null,null,null,null,"",{"$f":"IF($B42=\"\",\"\",(VLOOKUP($B42,Teams!$A$2:$C$51,2,FALSE)))","v":""},{"$f":"IF($B42=\"\",\"\",(VLOOKUP($B42,Teams!$A$2:$D$51,4,FALSE)))","v":""},{"$f":"IFERROR(F42-VLOOKUP(B42,ResultsC!$B$2:$M$51,12,0),\"\")","v":""},{"$f":"IFERROR(I42+VLOOKUP(B42,ResultsC!$B$2:$J$51,9,0)+VLOOKUP(B42,ResultsC!$B$2:$K$51,10,0)+VLOOKUP(B42,ResultsB!$B$2:$J$51,9,0)+VLOOKUP(B42,ResultsB!$B$2:$K$51,10,0)+VLOOKUP(B42,ResultsA!$B$2:$K$51,10,0),\"\")","v":""}]
[42,null,null,null,null,"",{"$f":"IF($B43=\"\",\"\",(VLOOKUP($B43,Teams!$A$2:$C$51,2,FALSE)))","v":""},{"$f":"IF($B43=\"\",\"\",(VLOOKUP($B43,Teams!$A$2:$D$51,4,FALSE)))","v":""},{"$f":"IFERROR(F43-VLOOKUP(B43,ResultsC!$B$2:$M$51,12,0),\"\")","v":""},{"$f":"IFERROR(I43+VLOOKUP(B43,ResultsC!$B$2:$J$51,9,0)+VLOOKUP(B43,ResultsC!$B$2:$K$51,10,0)+VLOOKUP(B43,ResultsB!$B$2:$J$51,9,0)+VLOOKUP(B43,ResultsB!$B$2:$K$51,10,0)+VLOOKUP(B43,ResultsA!$B$2:$K$51,10,0),\"\")","v":""}]
[43,null,null,null,null,"",{"$f":"IF($B44=\"\",\"\",(VLOOKUP($B44,Teams!$A$2:$C$51,2,FALSE)))","v":""},{"$f":"IF($B44=\"\",\"\",(VLOOKUP($B44,Teams!$A$2:$D$51,4,FALSE)))","v":""},{"$f":"IFERROR(F44-VLOOKUP(B44,ResultsC!$B$2:$M$51,12,0),\"\")","v":""},{"$f":"IFERROR(I44+VLOOKUP(B44,ResultsC!$B$2:$J$51,9,0)+VLOOKUP(B44,ResultsC!$B$2:$K$51,10,0)+VLOOKUP(B44,ResultsB!$B$2:$J$51,9,0)+VLOOKUP(B44,ResultsB!$B$2:$K$51,10,0)+VLOOKUP(B44,ResultsA!$B$2:$K$51,10,0),\"\")","v":""}]
[44,null,null,null,null,"",{"$f":"IF($B45=\"\",\"\",(VLOOKUP($B45,Teams!$A$2:$C$51,2,FALSE)))","v":""},{"$f":"IF($B45=\"\",\"\",(VLOOKUP($B45,Teams!$A$2:$D$51,4,FALSE)))","v":""},{"$f":"IFERROR(F45-VLOOKUP(B45,ResultsC!$B$2:$M$51,12,0),\"\")","v":""},{"$f":"IFERROR(I45+VLOOKUP(B45,ResultsC!$B$2:$J$51,9,0)+VLOOKUP(B45,ResultsC!$B$2:$K$51,10,0)+VLOOKUP(B45,ResultsB!$B$2:$J$51,9,0)+VLOOKUP(B45,ResultsB!$B$2:$K$51,10,0)+VLOOKUP(B45,ResultsA!$B$2:$K$51,10,0),\"\")","v":""}]
[45,null,null,null,null,"",{"$f":"IF($B46=\"\",\"\",(VLOOKUP($B46,Teams!$A$2:$C$51,2,FALSE)))","v":""},{"$f":"IF($B46=\"\",\"\",(VLOOKUP($B46,Teams!$A$2:$D$51,4,FALSE)))","v":""},{"$f":"IFERROR(F46-VLOOKUP(B46,ResultsC!$B$2:$M$51,12,0),\"\")","v":""},{"$f":"IFERROR(I46+VLOOKUP(B46,ResultsC!$B$2:$J$51,9,0)+VLOOKUP(B46,ResultsC!$B$2:$K$51,10,0)+VLOOKUP(B46,ResultsB!$B$2:$J$51,9,0)+VLOOKUP(B46,ResultsB!$B$2:$K$51,10,0)+VLOOKUP(B46,ResultsA!$B$2:$K$51,10,0),\"\")","v":""}]
[46,null,null,null,null,"",{"$f":"IF($B47=\"\",\"\",(VLOOKUP($B47,Teams!$A$2:$C$51,2,FALSE)))","v":""},{"$f":"IF($B47=\"\",\"\",(VLOOKUP($B47,Teams!$A$2:$D$51,4,FALSE)))","v":""},{"$f":"IFERROR(F47-VLOOKUP(B47,ResultsC!$B$2:$M$51,12,0),\"\")","v":""},{"$f":"IFERROR(I47+VLOOKUP(B47,ResultsC!$B$2:$J$51,9,0)+VLOOKUP(B47,ResultsC!$B$2:$K$51,10,0)+VLOOKUP(B47,ResultsB!$B$2:$J$51,9,0)+VLOOKUP(B47,ResultsB!$B$2:$K$51,10,0)+VLOOKUP(B47,ResultsA!$B$2:$K$51,10,0),\"\")","v":""}]
[47,null,null,null,null,"",{"$f":"IF($B48=\"\",\"\",(VLOOKUP($B48,Teams!$A$2:$C$51,2,FALSE)))","v":""},{"$f":"IF($B48=\"\",\"\",(VLOOKUP($B48,Teams!$A$2:$D$51,4,FALSE)))","v":""},{"$f":"IFERROR(F48-VLOOKUP(B48,ResultsC!$B$2:$M$51,12,0),\"\")","v":""},{"$f":"IFERROR(I48+VLOOKUP(B48,ResultsC!$B$2:$J$51,9,0)+VLOOKUP(B48,ResultsC!$B$2:$K$51,10,0)+VLOOKUP(B48,ResultsB!$B$2:$J$51,9,0)+VLOOKUP(B48,ResultsB!$B$2:$K$51,10,0)+VLOOKUP(B48,ResultsA!$B$2:$K$51,10,0),\"\")","v":""}]
[48,null,null,null,null,"",{"$f":"IF($B49=\"\",\"\",(VLOOKUP($B49,Teams!$A$2:$C$51,2,FALSE)))","v":""},{"$f":"IF($B49=\"\",\"\",(VLOOKUP($B49,Teams!$A$2:$D$51,4,FALSE)))","v":""},{"$f":"IFERROR(F49-VLOOKUP(B49,ResultsC!$B$2:$M$51,12,0),\"\")","v":""},{"$f":"IFERROR(I49+VLOOKUP(B49,ResultsC!$B$2:$J$51,9,0)+VLOOKUP(B49,ResultsC!$B$2:$K$51,10,0)+VLOOKUP(B49,ResultsB!$B$2:$J$51,9,0)+VLOOKUP(B49,ResultsB!$B$2:$K$51,10,0)+VLOOKUP(B49,ResultsA!$B$2:$K$51,10,0),\"\")","v":""}]
[49,null,null,null,null,"",{"$f":"IF($B50=\"\",\"\",(VLOOKUP($B50,Teams!$A$2:$C$51,2,FALSE)))","v":""},{"$f":"IF($B50=\"\",\"\",(VLOOKUP($B50,Teams!$A$2:$D$51,4,FALSE)))","v":""},{"$f":"IFERROR(F50-VLOOKUP(B50,ResultsC!$B$2:$M$51,12,0),\"\")","v":""},{"$f":"IFERROR(I50+VLOOKUP(B50,ResultsC!$B$2:$J$51,9,0)+VLOOKUP(B50,ResultsC!$B$2:$K$51,10,0)+VLOOKUP(B50,ResultsB!$B$2:$J$51,9,0)+VLOOKUP(B50,ResultsB!$B$2:$K$51,10,0)+VLOOKUP(B50,ResultsA!$B$2:$K$51,10,0),\"\")","v":""}]
[50,null,null,null,null,"",{"$f":"IF($B51=\"\",\"\",(VLOOKUP($B51,Teams!$A$2:$C$51,2,FALSE)))","v":""},{"$f":"IF($B51=\"\",\"\",(VLOOKUP($B51,Teams!$A$2:$D$51,4,FALSE)))","v":""},{"$f":"IFERROR(F51-VLOOKUP(B51,ResultsC!$B$2:$M$51,12,0),\"\")","v":""},{"$f":"IFERROR(I51+VLOOKUP(B51,ResultsC!$B$2:$J$51,9,0)+VLOOKUP(B51,ResultsC!$B$2:$K$51,10,0)+VLOOKUP(B51,ResultsB!$B$2:$J$51,9,0)+VLOOKUP(B51,ResultsB!$B$2:$K$51,10,0)+VLOOKUP(B51,ResultsA!$B$2:$K$51,10,0),\"\")","v":""}]

{"sheet":"HardCopy4","index":13,"n_rows":52,"n_cols":12,"rows_kept":52,"cut":false,"hidden":false,"merged":[[0,0,0,5],[0,7,0,11]]}
["TEAM TIMES",null,null,null,null,null,null,"LEG D TIMES"]
["Position","Number","ALT4","Club","M/F/X","ACT4",null,"Position","Number","ALT4","Club","M/F/X"]
[1,31,"00:48:29","Bingley A Holes","Male","03:30:49",null,1,31,"00:48:29","Bingley A Holes","Male"]
[2,52,"00:50:30","Keighley & Craven A ","Male","03:46:14",null,2,48,"00:48:59","Rudolf Needs A Vet","Mixed"]
[3,36,"00:59:07","Annie's Dream Team","Mixed","04:00:09",null,3,32,"00:49:24","Bingley B Stards","Male"]
[4,48,"00:48:59","Rudolf Needs A Vet","Mixed","04:05:15",null,4,52,"00:50:30","Keighley & Craven A ","Male"]
[5,32,"00:49:24","Bingley B Stards","Male","04:07:17",null,5,53,"00:54:06","Keighley & Craven B","Male"]
[6,49,"01:09:35","Real Men Wear Pink","Mixed","04:11:18",null,6,33,"00:56:25","Bingley C Rappers","Male"]
[7,50,"01:02:34","Barlick 3 Belles","Female","04:11:29",null,7,39,"00:57:42","St Nicks","Mixed"]
[8,53,"00:54:06","Keighley & Craven B","Male","04:14:06",null,8,55,"00:58:48","Bingley Angels","Female"]
[9,37,"01:01:39","Doddy Superhero","Mixed","04:18:28",null,9,36,"00:59:07","Annie's Dream Team","Mixed"]
[10,39,"00:57:42","St Nicks","Mixed","04:21:30",null,10,54,"01:00:58","Keighley & Craven C","Male"]
[11,55,"00:58:48","Bingley Angels","Female","04:25:34",null,11,43,"01:01:05","Pudsey P Dancers","Mixed"]
[12,35,"01:03:44","Skipton","Mixed","04:26:54",null,12,37,"01:01:39","Doddy Superhero","Mixed"]
[13,44,"01:04:07","K & C Arsey Amblers","Female","04:27:10",null,13,50,"01:02:34","Barlick 3 Belles","Female"]
[14,38,"01:03:59","Kirkham MX","Mixed","04:27:19",null,14,56,"01:02:55","Bingley Babes","Female"]
[15,33,"00:56:25","Bingley C Rappers","Male","04:27:27",null,15,46,"01:03:30","K & C Mega Munchers","Mixed"]
[16,54,"01:00:58","Keighley & Craven C","Male","04:36:23",null,16,35,"01:03:44","Skipton","Mixed"]
[17,56,"01:02:55","Bingley Babes","Female","04:41:20",null,17,38,"01:03:59","Kirkham MX","Mixed"]
[18,41,"01:17:38","Pudsey P Prancers","Male","04:42:24",null,18,44,"01:04:07","K & C Arsey Amblers","Female"]
[19,40,"01:12:56","Pudsey P Vixens","Female","05:04:38",null,19,45,"01:08:50","K & C Bottom Bloomers!!","Female"]
[20,43,"01:01:05","Pudsey P Dancers","Mixed","05:06:35",null,20,49,"01:09:35","Real Men Wear Pink","Mixed"]
[21,42,"01:26:58","Pudsey P Comets","Mixed","05:07:32",null,21,58,"01:09:58","Hail Marys","Female"]
[22,57,"01:14:48","Bingley Belles","Female","05:19:48",null,22,40,"01:12:56","Pudsey P Vixens","Female"]
[23,34,"01:14:32","Cononley","Mixed","05:20:22",null,23,34,"01:14:32","Cononley","Mixed"]
[24,58,"01:09:58","Hail Marys","Female","05:21:10",null,24,57,"01:14:48","Bingley Belles","Female"]
[25,46,"01:03:30","K & C Mega Munchers","Mixed","05:32:52",null,25,47,"01:15:38","K & C Marvellous Mincers!","Mixed"]
[26,51,"01:20:31","Barlick 4","Female","05:45:59",null,26,41,"01:17:38","Pudsey P Prancers","Male"]
[27,45,"01:08:50","K & C Bottom Bloomers!!","Female","05:47:36",null,27,51,"01:20:31","Barlick 4","Female"]
[28,47,"01:15:38","K & C Marvellous Mincers!","Mixed","07:20:05",null,28,42,"01:26:58","Pudsey P Comets","Mixed"]
[29,null,"","","","",null,29,null,"","",""]
[30,null,"","","","",null,30,null,"","",""]
[31,null,"","","","",null,31,null,"","",""]
[32,null,"","","","",null,32,null,"","",""]
[33,null,"","","","",null,33,null,"","",""]
[34,null,"","","","",null,34,null,"","",""]
[35,null,"","","","",null,35,null,"","",""]
[36,null,"","","","",null,36,null,"","",""]
[37,null,"","","","",null,37,null,"","",""]
[38,null,"","","","",null,38,null,"","",""]
[39,null,"","","","",null,39,null,"","",""]
[40,null,"","","","",null,40,null,"","",""]
[41,null,"","","","",null,41,null,"","",""]
[42,null,"","","","",null,42,null,"","",""]
[43,null,"","","","",null,43,null,"","",""]
[44,null,"","","","",null,44,null,"","",""]
[45,null,"","","","",null,45,null,"","",""]
[46,null,"","","","",null,46,null,"","",""]
[47,null,"","","","",null,47,null,"","",""]
[48,null,"","","","",null,48,null,"","",""]
[49,null,"","","","",null,49,null,"","",""]
[50,null,"","","","",null,50,null,"","",""]