{"text_format":"1","workbook":"xlsx","n_sheets":14,"sheets":["Input","Input2","Input3","Legs","Teams","Gender","ResultsA","HardCopy1","ResultsB","HardCopy2","ResultsC","HardCopy3","ResultsD","HardCopy4"],"not_rendered":{"charts":0,"images":0,"macros":1,"external_links":0,"defined_names":8,"comments":0,"pivot_tables":0},"unopened":[],"bounds":{"document_bytes":16777216,"sheet_cells":100000,"rows_first":2000,"rows_last":500,"rows_between":2000,"halvings":0,"cell_chars":16384,"cell_head_chars":4096},"cells_cut":0,"cells_raw":0,"read":"whole","date_system":"1900"}

{"sheet":"Input","index":0,"n_rows":37,"n_cols":3,"rows_kept":37,"cut":false,"hidden":true,"merged":[]}
["Race Number","M/F/X","Club"]
[1,"Mens","Baildon Blokes"]
[2,"Ladies","Baildon Belles"]
[3,"Mixed","Oh Little Town of Baildon"]
[4,"Mixed","Baildon Away in Some Trainers"]
[5,"Mixed","Baildon Rudolf & his Red Nosed Oh Dears"]
[6,"Mens","Heptonstall Hurriers"]
[7,"Mixed","Otley A"]
{"$rows_left_out":30}
{"sheet":"Input2","index":1,"n_rows":289,"n_cols":6,"rows_kept":289,"cut":false,"hidden":true,"merged":[]}
["Race Number","Leg","M/F/X","Club","First Name","Surname"]
[1,"A","Mens","Baildon Blokes"]
[1,"A","Mens","Baildon Blokes"]
[1,"B","Mens","Baildon Blokes"]
[1,"B","Mens","Baildon Blokes"]
[1,"C","Mens","Baildon Blokes"]
[1,"C","Mens","Baildon Blokes"]
[1,"D","Mens","Baildon Blokes"]
{"$rows_left_out":282}
{"sheet":"Input3","index":2,"n_rows":145,"n_cols":4,"rows_kept":145,"cut":false,"hidden":true,"merged":[]}
["Race Number","Leg","M/F/X","Club"]
[1,"A","Mens","Baildon Blokes"]
[1,"B","Mens","Baildon Blokes"]
[1,"C","Mens","Baildon Blokes"]
[1,"D","Mens","Baildon Blokes"]
[2,"A","Ladies","Baildon Belles"]
[2,"B","Ladies","Baildon Belles"]
[2,"C","Ladies","Baildon Belles"]
{"$rows_left_out":138}
{"sheet":"Legs","index":3,"n_rows":52,"n_cols":19,"rows_kept":52,"cut":false,"hidden":false,"merged":[]}
[]
[null,"Position","Number","Club","Cuml Time","M/F/X","Leg1","LegPos1","Leg2","LegPos2","Leg3","LegPos3","Leg4","Finish","Leg 2+3 >MST","FT1","FT2","FT3","FT4"]
[null,1,{"$f":"IF(ResultsD!B2=\"\",\"\",ResultsD!B2)","v":31},{"$f":"IFERROR(VLOOKUP(C3,Teams!$A$2:$B$51,2,0),\"\")","v":"Bingley A Holes"},{"$f":"IFERROR((G3+I3+K3+M3+O3),\"\")","v":"03:30:49"},{"$f":"IFERROR(VLOOKUP(C3,Teams!$A$2:$D$51,4,0),\"\")","v":"Male"},{"$f":"IFERROR(VLOOKUP($C3,ResultsA!$B$2:$K$51,10,0),\"\")","v":"01:00:17"},{"$f":"IFERROR(VLOOKUP($C3,ResultsA!$B$2:$N$52,13,0),\"\")","v":1},{"$f":"IFERROR(VLOOKUP($C3,ResultsB!$B$2:$K$51,10,0),\"\")","v":"01:06:29"},{"$f":"IFERROR(VLOOKUP($C3,ResultsB!$B$2:$N$52,13,0),\"\")","v":1},{"$f":"IFERROR(VLOOKUP($C3,ResultsC!$B$2:$K$51,10,0),\"\")","v":"00:35:34"},{"$f":"IFERROR(VLOOKUP($C3,ResultsC!$B$2:$N$51,13,0),\"\")","v":1},{"$f":"IFERROR(VLOOKUP($C3,ResultsD!$B$2:$I$51,8,0),\"\")","v":"00:48:29"},{"$f":"IF(C3=\"\",\"\",B3)","v":1},{"$f":"IFERROR(VLOOKUP(C3,ResultsC!$B$2:$J$51,9,0)+VLOOKUP(C3,ResultsB!$B$2:$J$51,9,0),\"\")","v":"00:00:00"},{"$f":"H3","v":1},{"$f":"IFERROR(RANK(I3,I$3:I$52,1),\"\")","v":2},{"$f":"IFERROR(RANK(K3,K$3:K$52,1),\"\")","v":1},{"$f":"IFERROR(RANK(M3,M$3:M$52,1),\"\")","v":1}]
[null,2,{"$f":"IF(ResultsD!B3=\"\",\"\",ResultsD!B3)","v":52},{"$f":"IFERROR(VLOOKUP(C4,Teams!$A$2:$B$51,2,0),\"\")","v":"Keighley & Craven A "},"03:46:14",{"$f":"IFERROR(VLOOKUP(C4,Teams!$A$2:$D$51,4,0),\"\")","v":"Male"},{"$f":"IFERROR(VLOOKUP($C4,ResultsA!$B$2:$K$51,10,0),\"\")","v":"01:09:34"},{"$f":"IFERROR(VLOOKUP($C4,ResultsA!$B$2:$N$52,13,0),\"\")","v":5},{"$f":"IFERROR(VLOOKUP($C4,ResultsB!$B$2:$K$51,10,0),\"\")","v":"01:06:53"},{"$f":"IFERROR(VLOOKUP($C4,ResultsB!$B$2:$N$52,13,0),\"\")","v":3},{"$f":"IFERROR(VLOOKUP($C4,ResultsC!$B$2:$K$51,10,0),\"\")","v":"00:39:17"},{"$f":"IFERROR(VLOOKUP($C4,ResultsC!$B$2:$N$51,13,0),\"\")","v":2},{"$f":"IFERROR(VLOOKUP($C4,ResultsD!$B$2:$I$51,8,0),\"\")","v":"00:50:30"},2,{"$f":"IFERROR(VLOOKUP(C4,ResultsC!$B$2:$J$51,9,0)+VLOOKUP(C4,ResultsB!$B$2:$J$51,9,0),\"\")","v":"00:00:00"},5,3,2,4]
[null,3,{"$f":"IF(ResultsD!B4=\"\",\"\",ResultsD!B4)","v":36},{"$f":"IFERROR(VLOOKUP(C5,Teams!$A$2:$B$51,2,0),\"\")","v":"Annie's Dream Team"},"04:00:09",{"$f":"IFERROR(VLOOKUP(C5,Teams!$A$2:$D$51,4,0),\"\")","v":"Mixed"},{"$f":"IFERROR(VLOOKUP($C5,ResultsA!$B$2:$K$51,10,0),\"\")","v":"01:04:12"},{"$f":"IFERROR(VLOOKUP($C5,ResultsA!$B$2:$N$52,13,0),\"\")","v":3},{"$f":"IFERROR(VLOOKUP($C5,ResultsB!$B$2:$K$51,10,0),\"\")","v":"01:03:29"},{"$f":"IFERROR(VLOOKUP($C5,ResultsB!$B$2:$N$52,13,0),\"\")","v":2},{"$f":"IFERROR(VLOOKUP($C5,ResultsC!$B$2:$K$51,10,0),\"\")","v":"00:53:21"},{"$f":"IFERROR(VLOOKUP($C5,ResultsC!$B$2:$N$51,13,0),\"\")","v":3},{"$f":"IFERROR(VLOOKUP($C5,ResultsD!$B$2:$I$51,8,0),\"\")","v":"00:59:07"},3,{"$f":"IFERROR(VLOOKUP(C5,ResultsC!$B$2:$J$51,9,0)+VLOOKUP(C5,ResultsB!$B$2:$J$51,9,0),\"\")","v":"00:00:00"},3,1,19,9]
[null,4,{"$f":"IF(ResultsD!B5=\"\",\"\",ResultsD!B5)","v":48},{"$f":"IFERROR(VLOOKUP(C6,Teams!$A$2:$B$51,2,0),\"\")","v":"Rudolf Needs A Vet"},"04:05:15",{"$f":"IFERROR(VLOOKUP(C6,Teams!$A$2:$D$51,4,0),\"\")","v":"Mixed"},{"$f":"IFERROR(VLOOKUP($C6,ResultsA!$B$2:$K$51,10,0),\"\")","v":"01:18:12"},{"$f":"IFERROR(VLOOKUP($C6,ResultsA!$B$2:$N$52,13,0),\"\")","v":13},{"$f":"IFERROR(VLOOKUP($C6,ResultsB!$B$2:$K$51,10,0),\"\")","v":"01:17:37"},{"$f":"IFERROR(VLOOKUP($C6,ResultsB!$B$2:$N$52,13,0),\"\")","v":13},{"$f":"IFERROR(VLOOKUP($C6,ResultsC!$B$2:$K$51,10,0),\"\")","v":"00:40:27"},{"$f":"IFERROR(VLOOKUP($C6,ResultsC!$B$2:$N$51,13,0),\"\")","v":6},{"$f":"IFERROR(VLOOKUP($C6,ResultsD!$B$2:$I$51,8,0),\"\")","v":"00:48:59"},4,{"$f":"IFERROR(VLOOKUP(C6,ResultsC!$B$2:$J$51,9,0)+VLOOKUP(C6,ResultsB!$B$2:$J$51,9,0),\"\")","v":"00:00:00"},13,11,4,2]
[null,5,{"$f":"IF(ResultsD!B6=\"\",\"\",ResultsD!B6)","v":32},{"$f":"IFERROR(VLOOKUP(C7,Teams!$A$2:$B$51,2,0),\"\")","v":"Bingley B Stards"},"04:07:17",{"$f":"IFERROR(VLOOKUP(C7,Teams!$A$2:$D$51,4,0),\"\")","v":"Male"},{"$f":"IFERROR(VLOOKUP($C7,ResultsA!$B$2:$K$51,10,0),\"\")","v":"01:10:27"},{"$f":"IFERROR(VLOOKUP($C7,ResultsA!$B$2:$N$52,13,0),\"\")","v":7},{"$f":"IFERROR(VLOOKUP($C7,ResultsB!$B$2:$K$51,10,0),\"\")","v":"01:26:26"},{"$f":"IFERROR(VLOOKUP($C7,ResultsB!$B$2:$N$52,13,0),\"\")","v":15},{"$f":"IFERROR(VLOOKUP($C7,ResultsC!$B$2:$K$51,10,0),\"\")","v":"00:41:00"},{"$f":"IFERROR(VLOOKUP($C7,ResultsC!$B$2:$N$51,13,0),\"\")","v":8},{"$f":"IFERROR(VLOOKUP($C7,ResultsD!$B$2:$I$51,8,0),\"\")","v":"00:49:24"},5,{"$f":"IFERROR(VLOOKUP(C7,ResultsC!$B$2:$J$51,9,0)+VLOOKUP(C7,ResultsB!$B$2:$J$51,9,0),\"\")","v":"00:00:00"},7,17,5,3]
[null,6,{"$f":"IF(ResultsD!B7=\"\",\"\",ResultsD!B7)","v":49},{"$f":"IFERROR(VLOOKUP(C8,Teams!$A$2:$B$51,2,0),\"\")","v":"Real Men Wear Pink"},"04:11:18",{"$f":"IFERROR(VLOOKUP(C8,Teams!$A$2:$D$51,4,0),\"\")","v":"Mixed"},{"$f":"IFERROR(VLOOKUP($C8,ResultsA!$B$2:$K$51,10,0),\"\")","v":"01:03:57"},{"$f":"IFERROR(VLOOKUP($C8,ResultsA!$B$2:$N$52,13,0),\"\")","v":2},{"$f":"IFERROR(VLOOKUP($C8,ResultsB!$B$2:$K$51,10,0),\"\")","v":"01:17:27"},{"$f":"IFERROR(VLOOKUP($C8,ResultsB!$B$2:$N$52,13,0),\"\")","v":4},{"$f":"IFERROR(VLOOKUP($C8,ResultsC!$B$2:$K$51,10,0),\"\")","v":"00:40:19"},{"$f":"IFERROR(VLOOKUP($C8,ResultsC!$B$2:$N$51,13,0),\"\")","v":4},{"$f":"IFERROR(VLOOKUP($C8,ResultsD!$B$2:$I$51,8,0),\"\")","v":"01:09:35"},6,{"$f":"IFERROR(VLOOKUP(C8,ResultsC!$B$2:$J$51,9,0)+VLOOKUP(C8,ResultsB!$B$2:$J$51,9,0),\"\")","v":"00:00:00"},2,10,3,20]
{"$rows_left_out":45}
{"sheet":"Teams","index":4,"n_rows":101,"n_cols":21,"rows_kept":101,"cut":false,"hidden":true,"merged":[]}
["Team No.","Team Name","Gender","TeamType","TN","Leg1","Name1","Leg2",null,"Leg3",null,"Leg4",null,null,"No","Name","Category","Leg 1","Leg 2","Leg 3","Leg 4"]
[31,"Bingley A Holes",1,{"$f":"IFERROR(VLOOKUP(C2,Gender!$A$2:$B$4,2,0),\"\")","v":"Male"},31,1,"Ian Holmes",2,"Paul Tiffany",3,"Graham Askew",4,"Ged Callan",null,1,"Bingley A Holes","MO","Ian Holmes","Paul Tiffany","Graham Askew","Ged Callan"]
[32,"Bingley B Stards",1,{"$f":"IFERROR(VLOOKUP(C3,Gender!$A$2:$B$4,2,0),\"\")","v":"Male"},31,1,"Andy Jebb",2,"Tom Gomersall",3,"Andy Siddle",4,"Steve Broadbent",null,null,"Dave Stephenson",null,"Andy Jebb","Tom Gomersall","Andy Siddle","Steve Broadbent"]
[33,"Bingley C Rappers",1,{"$f":"IFERROR(VLOOKUP(C4,Gender!$A$2:$B$4,2,0),\"\")","v":"Male"},32,1,"Dave Stephenson",2,"Myles Talbot",3,"James Askew",4,"Andy Gibbons",null,2,"Bingley B Stards","MO","Dave Stephenson","Myles Talbot","James Askew","Andy Gibbons"]
[34,"Cononley",6,{"$f":"IFERROR(VLOOKUP(C5,Gender!$A$2:$B$4,2,0),\"\")","v":"Mixed"},32,1,"Steve Fry",2,"Pete Stephens",3,"Carl Hitchens",4,"Martin Peace",null,null,"Dave Stephenson",null,"Steve Fry","Pete Stephens","Carl Hitchens","Martin Peace"]
[35,"Skipton",6,{"$f":"IFERROR(VLOOKUP(C6,Gender!$A$2:$B$4,2,0),\"\")","v":"Mixed"},33,1,"Mark Westman",2,"Phil Knight",3,"Richard Murray",4,"Adrian Netherwood",null,3,"Bingley C Rappers","MO","Mark Westman","Phil Knight","Richard Murray","Adrian Netherwood"]
[36,"Annie's Dream Team",6,{"$f":"IFERROR(VLOOKUP(C7,Gender!$A$2:$B$4,2,0),\"\")","v":"Mixed"},33,1,"Robbie Williams",2,"Gordon Weight",3,"Carl O’Mara",4,"Josh Netherwood",null,null,"Dave Stephenson",null,"Robbie Williams","Gordon Weight","Carl O’Mara","Josh Netherwood"]
[37,"Doddy Superhero",6,{"$f":"IFERROR(VLOOKUP(C8,Gender!$A$2:$B$4,2,0),\"\")","v":"Mixed"},34,1,"Russ Fairhurst",2,"Andy Kitts",3,"Sue Weeden",4,"Richard Hindle",null,4,"Cononley","O","Russ Fairhurst","Stef Kitts","Sue Weeden","Richard Hindle"]
{"$rows_left_out":94}
{"sheet":"Gender","index":5,"n_rows":4,"n_cols":5,"rows_kept":4,"cut":false,"hidden":true,"merged":[]}
["LookUp","Team","Start","MST1","Leg2"]
[1,"Male",27]
[6,"Mixed"]
[7,"Female"]

{"sheet":"ResultsA","index":6,"n_rows":51,"n_cols":15,"rows_kept":51,"cut":false,"hidden":true,"merged":[]}
["Position","Number","hours","mins","secs","Cuml Time","Club","M/F/X","MST Cuml1","Over MST","ALT1","ACT1","SOT1","LFP1","01:45:00"]
[1,31,1,0,17,{"$f":"IF(B2=\"\",\"\",TIME(C2,D2,E2))","v":"01:00:17"},{"$f":"IF($B2=\"\",\"\",(VLOOKUP($B2,Teams!$A$2:$C$51,2,FALSE)))","v":"Bingley A Holes"},{"$f":"IF($B2=\"\",\"\",(VLOOKUP($B2,Teams!$A$2:$D$51,4,FALSE)))","v":"Male"},{"$f":"IF(B2=\"\",\"\",$O$1)","v":"01:45:00"},{"$f":"IF(F2=\"\",\"\",IF((F2-I2)>0,F2-I2,0))","v":"00:00:00"},{"$f":"F2","v":"01:00:17"},{"$f":"F2","v":"01:00:17"},{"$f":"IF(F2<I2,F2,I2)","v":"01:00:17"},{"$f":"IF(B2=\"\",\"\",A2)","v":1}]
[2,49,1,3,57,"01:03:57",{"$f":"IF($B3=\"\",\"\",(VLOOKUP($B3,Teams!$A$2:$C$41,2,FALSE)))","v":"Real Men Wear Pink"},{"$f":"IF($B3=\"\",\"\",(VLOOKUP($B3,Teams!$A$2:$D$51,4,FALSE)))","v":"Mixed"},"01:45:00","00:00:00","01:03:57","01:03:57","01:03:57",{"$f":"IF(B3=\"\",\"\",A3)","v":2}]
[3,36,1,4,12,"01:04:12",{"$f":"IF($B4=\"\",\"\",(VLOOKUP($B4,Teams!$A$2:$C$41,2,FALSE)))","v":"Annie's Dream Team"},{"$f":"IF($B4=\"\",\"\",(VLOOKUP($B4,Teams!$A$2:$D$51,4,FALSE)))","v":"Mixed"},"01:45:00","00:00:00","01:04:12","01:04:12","01:04:12",3]
[4,42,1,9,18,"01:09:18",{"$f":"IF($B5=\"\",\"\",(VLOOKUP($B5,Teams!$A$2:$C$41,2,FALSE)))","v":"Pudsey P Comets"},{"$f":"IF($B5=\"\",\"\",(VLOOKUP($B5,Teams!$A$2:$D$51,4,FALSE)))","v":"Mixed"},"01:45:00","00:00:00","01:09:18","01:09:18","01:09:18",4]
[5,52,1,9,34,"01:09:34",{"$f":"IF($B6=\"\",\"\",(VLOOKUP($B6,Teams!$A$2:$C$41,2,FALSE)))","v":"Keighley & Craven A "},{"$f":"IF($B6=\"\",\"\",(VLOOKUP($B6,Teams!$A$2:$D$51,4,FALSE)))","v":"Male"},"01:45:00","00:00:00","01:09:34","01:09:34","01:09:34",5]
[6,39,1,10,7,"01:10:07",{"$f":"IF($B7=\"\",\"\",(VLOOKUP($B7,Teams!$A$2:$C$41,2,FALSE)))","v":"St Nicks"},{"$f":"IF($B7=\"\",\"\",(VLOOKUP($B7,Teams!$A$2:$D$51,4,FALSE)))","v":"Mixed"},"01:45:00","00:00:00","01:10:07","01:10:07","01:10:07",6]
[7,32,1,10,27,"01:10:27",{"$f":"IF($B8=\"\",\"\",(VLOOKUP($B8,Teams!$A$2:$C$41,2,FALSE)))","v":"Bingley B Stards"},{"$f":"IF($B8=\"\",\"\",(VLOOKUP($B8,Teams!$A$2:$D$51,4,FALSE)))","v":"Male"},"01:45:00","00:00:00","01:10:27","01:10:27","01:10:27",7]
{"$rows_left_out":44}
{"sheet":"HardCopy1","index":7,"n_rows":51,"n_cols":6,"rows_kept":51,"cut":false,"hidden":false,"merged":[]}
["Position","Number","Cuml Time","Club","M/F/X","Over MST"]
[1,31,"01:00:17","Bingley A Holes","Male","00:00:00"]
[2,49,"01:03:57","Real Men Wear Pink","Mixed","00:00:00"]
[3,36,"01:04:12","Annie's Dream Team","Mixed","00:00:00"]
[4,42,"01:09:18","Pudsey P Comets","Mixed","00:00:00"]
[5,52,"01:09:34","Keighley & Craven A ","Male","00:00:00"]
[6,39,"01:10:07","St Nicks","Mixed","00:00:00"]
[7,32,"01:10:27","Bingley B Stards","Male","00:00:00"]
{"$rows_left_out":44}
{"sheet":"ResultsB","index":8,"n_rows":51,"n_cols":16,"rows_kept":51,"cut":false,"hidden":true,"merged":[]}
["Position","Number","hours","mins","secs","Cuml Time","Club","M/F/X","MST Cuml2","Over MST","ALT2","ACT2","SOT2","LFP2",null,"03:15:00"]
[1,31,2,6,46,{"$f":"IF(B2=\"\",\"\",TIME(C2,D2,E2))","v":"02:06:46"},{"$f":"IF($B2=\"\",\"\",(VLOOKUP($B2,Teams!$A$2:$C$51,2,FALSE)))","v":"Bingley A Holes"},{"$f":"IF($B2=\"\",\"\",(VLOOKUP($B2,Teams!$A$2:$D$51,4,FALSE)))","v":"Male"},{"$f":"IF(B2=\"\",\"\",$P$1)","v":"03:15:00"},{"$f":"IFERROR(IF((F2-I2)>0,F2-I2,0),\"\")","v":"00:00:00"},{"$f":"IFERROR(VLOOKUP(B2,$B$2:$F$51,5,0)-VLOOKUP(B2,ResultsA!$B$2:$M$51,12,0),\"\")","v":"01:06:29"},{"$f":"IFERROR(VLOOKUP(B2,$B$2:$K$51,10,0)+VLOOKUP(B2,ResultsA!$B$2:$F$51,5,FALSE),\"\")","v":"02:06:46"},{"$f":"IF(F2<I2,F2,I2)","v":"02:06:46"},{"$f":"IF(B2=\"\",\"\",RANK(L2,$L$2:$L$51,1))","v":1}]
[2,36,2,7,41,{"$f":"IF(B3=\"\",\"\",TIME(C3,D3,E3))","v":"02:07:41"},{"$f":"IF($B3=\"\",\"\",(VLOOKUP($B3,Teams!$A$2:$C$51,2,FALSE)))","v":"Annie's Dream Team"},{"$f":"IF($B3=\"\",\"\",(VLOOKUP($B3,Teams!$A$2:$D$51,4,FALSE)))","v":"Mixed"},{"$f":"IF(B3=\"\",\"\",$P$1)","v":"03:15:00"},"00:00:00",{"$f":"IFERROR(VLOOKUP(B3,$B$2:$F$51,5,0)-VLOOKUP(B3,ResultsA!$B$2:$M$51,12,0),\"\")","v":"01:03:29"},{"$f":"IFERROR(VLOOKUP(B3,$B$2:$K$51,10,0)+VLOOKUP(B3,ResultsA!$B$2:$F$51,5,FALSE),\"\")","v":"02:07:41"},{"$f":"IF(F3<I3,F3,I3)","v":"02:07:41"},{"$f":"IF(B3=\"\",\"\",RANK(L3,$L$2:$L$51,1))","v":2}]
[3,52,2,16,27,"02:16:27",{"$f":"IF($B4=\"\",\"\",(VLOOKUP($B4,Teams!$A$2:$C$51,2,FALSE)))","v":"Keighley & Craven A "},{"$f":"IF($B4=\"\",\"\",(VLOOKUP($B4,Teams!$A$2:$D$51,4,FALSE)))","v":"Male"},"03:15:00","00:00:00",{"$f":"IFERROR(VLOOKUP(B4,$B$2:$F$51,5,0)-VLOOKUP(B4,ResultsA!$B$2:$M$51,12,0),\"\")","v":"01:06:53"},{"$f":"IFERROR(VLOOKUP(B4,$B$2:$K$51,10,0)+VLOOKUP(B4,ResultsA!$B$2:$F$51,5,FALSE),\"\")","v":"02:16:27"},"02:16:27",3]
[4,49,2,21,24,"02:21:24",{"$f":"IF($B5=\"\",\"\",(VLOOKUP($B5,Teams!$A$2:$C$51,2,FALSE)))","v":"Real Men Wear Pink"},{"$f":"IF($B5=\"\",\"\",(VLOOKUP($B5,Teams!$A$2:$D$51,4,FALSE)))","v":"Mixed"},"03:15:00","00:00:00",{"$f":"IFERROR(VLOOKUP(B5,$B$2:$F$51,5,0)-VLOOKUP(B5,ResultsA!$B$2:$M$51,12,0),\"\")","v":"01:17:27"},{"$f":"IFERROR(VLOOKUP(B5,$B$2:$K$51,10,0)+VLOOKUP(B5,ResultsA!$B$2:$F$51,5,FALSE),\"\")","v":"02:21:24"},"02:21:24",4]
[5,50,2,26,35,"02:26:35",{"$f":"IF($B6=\"\",\"\",(VLOOKUP($B6,Teams!$A$2:$C$51,2,FALSE)))","v":"Barlick 3 Belles"},{"$f":"IF($B6=\"\",\"\",(VLOOKUP($B6,Teams!$A$2:$D$51,4,FALSE)))","v":"Female"},"03:15:00","00:00:00",{"$f":"IFERROR(VLOOKUP(B6,$B$2:$F$51,5,0)-VLOOKUP(B6,ResultsA!$B$2:$M$51,12,0),\"\")","v":"01:13:45"},{"$f":"IFERROR(VLOOKUP(B6,$B$2:$K$51,10,0)+VLOOKUP(B6,ResultsA!$B$2:$F$51,5,FALSE),\"\")","v":"02:26:35"},"02:26:35",5]
[6,37,2,29,42,"02:29:42",{"$f":"IF($B7=\"\",\"\",(VLOOKUP($B7,Teams!$A$2:$C$51,2,FALSE)))","v":"Doddy Superhero"},{"$f":"IF($B7=\"\",\"\",(VLOOKUP($B7,Teams!$A$2:$D$51,4,FALSE)))","v":"Mixed"},"03:15:00","00:00:00",{"$f":"IFERROR(VLOOKUP(B7,$B$2:$F$51,5,0)-VLOOKUP(B7,ResultsA!$B$2:$M$51,12,0),\"\")","v":"01:16:10"},{"$f":"IFERROR(VLOOKUP(B7,$B$2:$K$51,10,0)+VLOOKUP(B7,ResultsA!$B$2:$F$51,5,FALSE),\"\")","v":"02:29:42"},"02:29:42",6]
[7,39,2,29,49,"02:29:49",{"$f":"IF($B8=\"\",\"\",(VLOOKUP($B8,Teams!$A$2:$C$51,2,FALSE)))","v":"St Nicks"},{"$f":"IF($B8=\"\",\"\",(VLOOKUP($B8,Teams!$A$2:$D$51,4,FALSE)))","v":"Mixed"},"03:15:00","00:00:00",{"$f":"IFERROR(VLOOKUP(B8,$B$2:$F$51,5,0)-VLOOKUP(B8,ResultsA!$B$2:$M$51,12,0),\"\")","v":"01:19:42"},{"$f":"IFERROR(VLOOKUP(B8,$B$2:$K$51,10,0)+VLOOKUP(B8,ResultsA!$B$2:$F$51,5,FALSE),\"\")","v":"02:29:49"},"02:29:49",7]
{"$rows_left_out":44}
{"sheet":"HardCopy2","index":9,"n_rows":52,"n_cols":13,"rows_kept":52,"cut":false,"hidden":false,"merged":[[0,0,0,6],[0,8,0,12]]}
["TEAM TIMES",null,null,null,null,null,null,null,"LEG B TIMES"]
["Position","Number","ALT2","Club","M/F/X","Over MST","ACT2",null,"Position","Number","ALT2","Club","M/F/X"]
[1,31,"01:06:29","Bingley A Holes","Male","00:00:00","02:06:46",null,1,36,"01:03:29","Annie's Dream Team","Mixed"]
[2,36,"01:03:29","Annie's Dream Team","Mixed","00:00:00","02:07:41",null,2,31,"01:06:29","Bingley A Holes","Male"]
[3,52,"01:06:53","Keighley & Craven A ","Male","00:00:00","02:16:27",null,3,52,"01:06:53","Keighley & Craven A ","Male"]
[4,49,"01:17:27","Real Men Wear Pink","Mixed","00:00:00","02:21:24",null,4,38,"01:08:26","Kirkham MX","Mixed"]
[5,50,"01:13:45","Barlick 3 Belles","Female","00:00:00","02:26:35",null,5,35,"01:13:20","Skipton","Mixed"]
[6,37,"01:16:10","Doddy Superhero","Mixed","00:00:00","02:29:42",null,6,50,"01:13:45","Barlick 3 Belles","Female"]
{"$rows_left_out":45}
{"sheet":"ResultsC","index":10,"n_rows":51,"n_cols":15,"rows_kept":51,"cut":false,"hidden":true,"merged":[]}
["Position","Number","hours","mins","secs","Cuml Time","Club","M/F/X","MST Cuml3","Over MST","ALT3","ACT3","SOT3","LFP3","04:00:00"]
[1,31,2,42,20,{"$f":"IF(B2=\"\",\"\",TIME(C2,D2,E2))","v":"02:42:20"},{"$f":"IF($B2=\"\",\"\",(VLOOKUP($B2,Teams!$A$2:$C$51,2,FALSE)))","v":"Bingley A Holes"},{"$f":"IF($B2=\"\",\"\",(VLOOKUP($B2,Teams!$A$2:$D$51,4,FALSE)))","v":"Male"},{"$f":"IF(B2=\"\",\"\",$O$1)","v":"04:00:00"},{"$f":"IF(F2=\"\",\"\",IF((F2-I2)>0,F2-I2,0))","v":"00:00:00"},{"$f":"IFERROR(F2-VLOOKUP(B2,ResultsB!$B$2:$M$51,12,0),\"\")","v":"00:35:34"},{"$f":"IFERROR(F2+VLOOKUP(B2,ResultsB!$B$2:$J$51,9,0),\"\")","v":"02:42:20"},{"$f":"IF(F2<I2,F2,I2)","v":"02:42:20"},1]
[2,52,2,55,44,{"$f":"IF(B3=\"\",\"\",TIME(C3,D3,E3))","v":"02:55:44"},{"$f":"IF($B3=\"\",\"\",(VLOOKUP($B3,Teams!$A$2:$C$51,2,FALSE)))","v":"Keighley & Craven A "},{"$f":"IF($B3=\"\",\"\",(VLOOKUP($B3,Teams!$A$2:$D$51,4,FALSE)))","v":"Male"},"04:00:00","00:00:00",{"$f":"IFERROR(F3-VLOOKUP(B3,ResultsB!$B$2:$M$51,12,0),\"\")","v":"00:39:17"},{"$f":"IFERROR(F3+VLOOKUP(B3,ResultsB!$B$2:$J$51,9,0),\"\")","v":"02:55:44"},"02:55:44",2]
[3,36,3,1,2,"03:01:02",{"$f":"IF($B4=\"\",\"\",(VLOOKUP($B4,Teams!$A$2:$C$51,2,FALSE)))","v":"Annie's Dream Team"},{"$f":"IF($B4=\"\",\"\",(VLOOKUP($B4,Teams!$A$2:$D$51,4,FALSE)))","v":"Mixed"},"04:00:00","00:00:00",{"$f":"IFERROR(F4-VLOOKUP(B4,ResultsB!$B$2:$M$51,12,0),\"\")","v":"00:53:21"},{"$f":"IFERROR(F4+VLOOKUP(B4,ResultsB!$B$2:$J$51,9,0),\"\")","v":"03:01:02"},"03:01:02",3]
[4,49,3,1,43,"03:01:43",{"$f":"IF($B5=\"\",\"\",(VLOOKUP($B5,Teams!$A$2:$C$51,2,FALSE)))","v":"Real Men Wear Pink"},{"$f":"IF($B5=\"\",\"\",(VLOOKUP($B5,Teams!$A$2:$D$51,4,FALSE)))","v":"Mixed"},"04:00:00","00:00:00",{"$f":"IFERROR(F5-VLOOKUP(B5,ResultsB!$B$2:$M$51,12,0),\"\")","v":"00:40:19"},{"$f":"IFERROR(F5+VLOOKUP(B5,ResultsB!$B$2:$J$51,9,0),\"\")","v":"03:01:43"},"03:01:43",4]
[5,50,3,8,55,"03:08:55",{"$f":"IF($B6=\"\",\"\",(VLOOKUP($B6,Teams!$A$2:$C$51,2,FALSE)))","v":"Barlick 3 Belles"},{"$f":"IF($B6=\"\",\"\",(VLOOKUP($B6,Teams!$A$2:$D$51,4,FALSE)))","v":"Female"},"04:00:00","00:00:00",{"$f":"IFERROR(F6-VLOOKUP(B6,ResultsB!$B$2:$M$51,12,0),\"\")","v":"00:42:20"},{"$f":"IFERROR(F6+VLOOKUP(B6,ResultsB!$B$2:$J$51,9,0),\"\")","v":"03:08:55"},"03:08:55",5]
[6,48,3,16,16,"03:16:16",{"$f":"IF($B7=\"\",\"\",(VLOOKUP($B7,Teams!$A$2:$C$51,2,FALSE)))","v":"Rudolf Needs A Vet"},{"$f":"IF($B7=\"\",\"\",(VLOOKUP($B7,Teams!$A$2:$D$51,4,FALSE)))","v":"Mixed"},"04:00:00","00:00:00",{"$f":"IFERROR(F7-VLOOKUP(B7,ResultsB!$B$2:$M$51,12,0),\"\")","v":"00:40:27"},{"$f":"IFERROR(F7+VLOOKUP(B7,ResultsB!$B$2:$J$51,9,0),\"\")","v":"03:16:16"},"03:16:16",6]
[7,37,3,16,49,"03:16:49",{"$f":"IF($B8=\"\",\"\",(VLOOKUP($B8,Teams!$A$2:$C$51,2,FALSE)))","v":"Doddy Superhero"},{"$f":"IF($B8=\"\",\"\",(VLOOKUP($B8,Teams!$A$2:$D$51,4,FALSE)))","v":"Mixed"},"04:00:00","00:00:00",{"$f":"IFERROR(F8-VLOOKUP(B8,ResultsB!$B$2:$M$51,12,0),\"\")","v":"00:47:07"},{"$f":"IFERROR(F8+VLOOKUP(B8,ResultsB!$B$2:$J$51,9,0),\"\")","v":"03:16:49"},"03:16:49",7]
{"$rows_left_out":44}
{"sheet":"HardCopy3","index":11,"n_rows":52,"n_cols":13,"rows_kept":52,"cut":false,"hidden":false,"merged":[[0,0,0,6],[0,8,0,12]]}
["TEAM TIMES",null,null,null,null,null,null,null,"LEG C TIMES"]
["Position","Number","ALT3","Club","M/F/X","Over MST","ACT3",null,"Position","Number","ALT3","Club","M/F/X"]
[1,31,"00:35:34","Bingley A Holes","Male","00:00:00","02:42:20",null,1,31,"00:35:34","Bingley A Holes","Male"]
[2,52,"00:39:17","Keighley & Craven A ","Male","00:00:00","02:55:44",null,2,52,"00:39:17","Keighley & Craven A ","Male"]
[3,36,"00:53:21","Annie's Dream Team","Mixed","00:00:00","03:01:02",null,3,49,"00:40:19","Real Men Wear Pink","Mixed"]
[4,49,"00:40:19","Real Men Wear Pink","Mixed","00:00:00","03:01:43",null,4,48,"00:40:27","Rudolf Needs A Vet","Mixed"]
[5,50,"00:42:20","Barlick 3 Belles","Female","00:00:00","03:08:55",null,5,32,"00:41:00","Bingley B Stards","Male"]
[6,48,"00:40:27","Rudolf Needs A Vet","Mixed","00:00:00","03:16:16",null,6,50,"00:42:20","Barlick 3 Belles","Female"]
{"$rows_left_out":45}
{"sheet":"ResultsD","index":12,"n_rows":51,"n_cols":10,"rows_kept":51,"cut":false,"hidden":true,"merged":[]}
["Position","Number","hours","mins","secs","Cuml Time","Club","M/F/X","ALT4","ACT4"]
[1,31,3,30,49,{"$f":"IF(B2=\"\",\"\",TIME(C2,D2,E2))","v":"03:30:49"},{"$f":"IF($B2=\"\",\"\",(VLOOKUP($B2,Teams!$A$2:$C$51,2,FALSE)))","v":"Bingley A Holes"},{"$f":"IF($B2=\"\",\"\",(VLOOKUP($B2,Teams!$A$2:$D$51,4,FALSE)))","v":"Male"},{"$f":"IFERROR(F2-VLOOKUP(B2,ResultsC!$B$2:$M$51,12,0),\"\")","v":"00:48:29"},{"$f":"IFERROR(I2+VLOOKUP(B2,ResultsC!$B$2:$J$51,9,0)+VLOOKUP(B2,ResultsC!$B$2:$K$51,10,0)+VLOOKUP(B2,ResultsB!$B$2:$J$51,9,0)+VLOOKUP(B2,ResultsB!$B$2:$K$51,10,0)+VLOOKUP(B2,ResultsA!$B$2:$K$51,10,0),\"\")","v":"03:30:49"}]
[2,52,3,46,14,"03:46:14",{"$f":"IF($B3=\"\",\"\",(VLOOKUP($B3,Teams!$A$2:$C$51,2,FALSE)))","v":"Keighley & Craven A "},{"$f":"IF($B3=\"\",\"\",(VLOOKUP($B3,Teams!$A$2:$D$51,4,FALSE)))","v":"Male"},{"$f":"IFERROR(F3-VLOOKUP(B3,ResultsC!$B$2:$M$51,12,0),\"\")","v":"00:50:30"},{"$f":"IFERROR(I3+VLOOKUP(B3,ResultsC!$B$2:$J$51,9,0)+VLOOKUP(B3,ResultsC!$B$2:$K$51,10,0)+VLOOKUP(B3,ResultsB!$B$2:$J$51,9,0)+VLOOKUP(B3,ResultsB!$B$2:$K$51,10,0)+VLOOKUP(B3,ResultsA!$B$2:$K$51,10,0),\"\")","v":"03:46:14"}]
[3,36,4,0,9,"04:00:09",{"$f":"IF($B4=\"\",\"\",(VLOOKUP($B4,Teams!$A$2:$C$51,2,FALSE)))","v":"Annie's Dream Team"},{"$f":"IF($B4=\"\",\"\",(VLOOKUP($B4,Teams!$A$2:$D$51,4,FALSE)))","v":"Mixed"},{"$f":"IFERROR(F4-VLOOKUP(B4,ResultsC!$B$2:$M$51,12,0),\"\")","v":"00:59:07"},{"$f":"IFERROR(I4+VLOOKUP(B4,ResultsC!$B$2:$J$51,9,0)+VLOOKUP(B4,ResultsC!$B$2:$K$51,10,0)+VLOOKUP(B4,ResultsB!$B$2:$J$51,9,0)+VLOOKUP(B4,ResultsB!$B$2:$K$51,10,0)+VLOOKUP(B4,ResultsA!$B$2:$K$51,10,0),\"\")","v":"04:00:09"}]
[4,48,4,5,15,"04:05:15",{"$f":"IF($B5=\"\",\"\",(VLOOKUP($B5,Teams!$A$2:$C$51,2,FALSE)))","v":"Rudolf Needs A Vet"},{"$f":"IF($B5=\"\",\"\",(VLOOKUP($B5,Teams!$A$2:$D$51,4,FALSE)))","v":"Mixed"},{"$f":"IFERROR(F5-VLOOKUP(B5,ResultsC!$B$2:$M$51,12,0),\"\")","v":"00:48:59"},{"$f":"IFERROR(I5+VLOOKUP(B5,ResultsC!$B$2:$J$51,9,0)+VLOOKUP(B5,ResultsC!$B$2:$K$51,10,0)+VLOOKUP(B5,ResultsB!$B$2:$J$51,9,0)+VLOOKUP(B5,ResultsB!$B$2:$K$51,10,0)+VLOOKUP(B5,ResultsA!$B$2:$K$51,10,0),\"\")","v":"04:05:15"}]
[5,32,4,7,17,"04:07:17",{"$f":"IF($B6=\"\",\"\",(VLOOKUP($B6,Teams!$A$2:$C$51,2,FALSE)))","v":"Bingley B Stards"},{"$f":"IF($B6=\"\",\"\",(VLOOKUP($B6,Teams!$A$2:$D$51,4,FALSE)))","v":"Male"},{"$f":"IFERROR(F6-VLOOKUP(B6,ResultsC!$B$2:$M$51,12,0),\"\")","v":"00:49:24"},{"$f":"IFERROR(I6+VLOOKUP(B6,ResultsC!$B$2:$J$51,9,0)+VLOOKUP(B6,ResultsC!$B$2:$K$51,10,0)+VLOOKUP(B6,ResultsB!$B$2:$J$51,9,0)+VLOOKUP(B6,ResultsB!$B$2:$K$51,10,0)+VLOOKUP(B6,ResultsA!$B$2:$K$51,10,0),\"\")","v":"04:07:17"}]
[6,49,4,11,18,"04:11:18",{"$f":"IF($B7=\"\",\"\",(VLOOKUP($B7,Teams!$A$2:$C$51,2,FALSE)))","v":"Real Men Wear Pink"},{"$f":"IF($B7=\"\",\"\",(VLOOKUP($B7,Teams!$A$2:$D$51,4,FALSE)))","v":"Mixed"},{"$f":"IFERROR(F7-VLOOKUP(B7,ResultsC!$B$2:$M$51,12,0),\"\")","v":"01:09:35"},{"$f":"IFERROR(I7+VLOOKUP(B7,ResultsC!$B$2:$J$51,9,0)+VLOOKUP(B7,ResultsC!$B$2:$K$51,10,0)+VLOOKUP(B7,ResultsB!$B$2:$J$51,9,0)+VLOOKUP(B7,ResultsB!$B$2:$K$51,10,0)+VLOOKUP(B7,ResultsA!$B$2:$K$51,10,0),\"\")","v":"04:11:18"}]
[7,50,4,11,29,"04:11:29",{"$f":"IF($B8=\"\",\"\",(VLOOKUP($B8,Teams!$A$2:$C$51,2,FALSE)))","v":"Barlick 3 Belles"},{"$f":"IF($B8=\"\",\"\",(VLOOKUP($B8,Teams!$A$2:$D$51,4,FALSE)))","v":"Female"},{"$f":"IFERROR(F8-VLOOKUP(B8,ResultsC!$B$2:$M$51,12,0),\"\")","v":"01:02:34"},{"$f":"IFERROR(I8+VLOOKUP(B8,ResultsC!$B$2:$J$51,9,0)+VLOOKUP(B8,ResultsC!$B$2:$K$51,10,0)+VLOOKUP(B8,ResultsB!$B$2:$J$51,9,0)+VLOOKUP(B8,ResultsB!$B$2:$K$51,10,0)+VLOOKUP(B8,ResultsA!$B$2:$K$51,10,0),\"\")","v":"04:11:29"}]
{"$rows_left_out":44}
{"sheet":"HardCopy4","index":13,"n_rows":52,"n_cols":12,"rows_kept":52,"cut":false,"hidden":false,"merged":[[0,0,0,5],[0,7,0,11]]}
["TEAM TIMES",null,null,null,null,null,null,"LEG D TIMES"]
["Position","Number","ALT4","Club","M/F/X","ACT4",null,"Position","Number","ALT4","Club","M/F/X"]
[1,31,"00:48:29","Bingley A Holes","Male","03:30:49",null,1,31,"00:48:29","Bingley A Holes","Male"]
[2,52,"00:50:30","Keighley & Craven A ","Male","03:46:14",null,2,48,"00:48:59","Rudolf Needs A Vet","Mixed"]
[3,36,"00:59:07","Annie's Dream Team","Mixed","04:00:09",null,3,32,"00:49:24","Bingley B Stards","Male"]
[4,48,"00:48:59","Rudolf Needs A Vet","Mixed","04:05:15",null,4,52,"00:50:30","Keighley & Craven A ","Male"]
[5,32,"00:49:24","Bingley B Stards","Male","04:07:17",null,5,53,"00:54:06","Keighley & Craven B","Male"]
[6,49,"01:09:35","Real Men Wear Pink","Mixed","04:11:18",null,6,33,"00:56:25","Bingley C Rappers","Male"]
{"$rows_left_out":44}