{"text_format":"1","workbook":"xlsx","n_sheets":12,"sheets":["Events","Overall Champs","2017 extreme Table","2017 fell Table","2017 xc Table","2017 Road Table","2017 marathon & half","2017 extreme results","2017 fell results","2017 Road results","2017 xc results","Age Cat"],"not_rendered":{"charts":0,"images":1,"macros":1,"external_links":1,"defined_names":10,"comments":4,"pivot_tables":0},"unopened":[],"bounds":{"document_bytes":16777216,"sheet_cells":100000,"rows_first":2000,"rows_last":500,"rows_between":2000,"halvings":0,"cell_chars":16384,"cell_head_chars":4096},"cells_cut":0,"cells_raw":0,"read":"whole","date_system":"1900"}

{"sheet":"Events","index":0,"n_rows":13,"n_cols":5,"rows_kept":13,"cut":false,"hidden":false,"merged":[]}
[]
[]
["FELL CHAMPIONSHIPS 2017","ROAD CHAMPIONSHIPS 2017","EXTREME CHAMPIONSHIPS 2017","XC CHAMPIONSHIPS 2017","ALL ROUND CHAMPIONSHIPS 2017"]
["(Best 5 of 9)","(Best 5 of 9)","Best 3 of 5)","(Best 4 of 7)","(Best 5 races to qualify)"]
["Jan 28th Hoofstones 8M BM","Mar 19th Bradford 10K ","Feb 4th Rombald Stride 23M ","Jan17 Yorkshire Champs ","Best 2 Fell"]
["Feb 18th Bleasdale Circle 5M AS ","May 3/10/17thEsholt (Series) 5K YVAA","Apr 29th 3 Peaks 23.2M AL ","Feb17 National Champs ","Best 2 Road"]
{"$rows_left_out":8}
{"sheet":"Overall Champs","index":1,"n_rows":47,"n_cols":24,"rows_kept":47,"cut":false,"hidden":false,"merged":[[47,5,47,10],[58,2,58,11],[5,9,5,10],[4,9,4,10],[4,23,5,23],[4,21,4,22],[5,21,5,22],[2,20,2,23],[1,1,3,2],[4,1,5,1],[4,2,5,2],[4,11,5,11],[1,5,1,19],[4,13,5,13],[4,14,5,14]]}
[]
[]
[null,null,null,null,null,null,null,null,null,null,null,null,null,null,null,null,null,null,null,null,{"$f":"TODAY()","v":"2017-05-11"}]
[null,null,null,null,null,"Best Road","2nd Best Road","Best Fell","2nd Best Fell","Best Cross Country","Best Extreme",null,null,null,null,null,null,{"$f":"F4","v":"Best Road"},"2nd Best Road","Best Fell","2nd Best Fell","Best Cross Country","Best Extreme"]
[null,"Pos","Name",null,null,1,2,3,4,5,null,"Scoring Total",null,"Pos","Name",null,null,1,2,3,4,5,null,"Scoring Total"]
[null,null,null,null,null,null,null,null,null,"(Best Score Counts)",null,null,null,null,null,null,null,null,null,null,null,"(Best Score Counts)"]
{"$rows_left_out":42}
{"sheet":"2017 extreme Table","index":2,"n_rows":61,"n_cols":18,"rows_kept":61,"cut":false,"hidden":false,"merged":[[0,0,1,1],[2,0,3,0],[2,1,3,1],[2,8,3,8],[2,9,3,9],[2,11,2,13],[42,11,42,13],[66,1,66,9],[42,0,43,0],[42,1,43,1],[42,8,43,8],[42,9,43,9],[55,3,55,7],[55,8,55,10],[2,10,3,10],[42,10,43,10]]}
["2017 - Extreme\n(Best 3 of 5 Races)"]
[null,null,null,{"$f":"VLOOKUP(D3,$A$57:$C$65,3,FALSE)","v":"Rombald Stride 23m"},{"$f":"VLOOKUP(E3,$A$57:$C$65,3,FALSE)","v":"3 Peaks 23.2m"},{"$f":"VLOOKUP(F3,$A$57:$C$65,3,FALSE)","v":"Ennerdale 22.9m"},{"$f":"VLOOKUP(G3,$A$57:$C$65,3,FALSE)","v":"Borrowdale 16.8m"},{"$f":"VLOOKUP(H3,$A$57:$C$65,3,FALSE)","v":"Full Tour of Pendle 16.8m"}]
["Pos","Name",null,1,2,3,4,5,"Total","Scoring Total","# Races","Top 3 results"]
[null,null,null,{"$f":"VLOOKUP(D3,$A$57:$C$65,2,FALSE)","v":"2017-02-04"},{"$f":"VLOOKUP(E3,$A$57:$C$65,2,FALSE)","v":"2017-04-29"},{"$f":"VLOOKUP(F3,$A$57:$C$65,2,FALSE)","v":"2017-06-10"},{"$f":"VLOOKUP(G3,$A$57:$C$65,2,FALSE)","v":"2017-08-05"},{"$f":"VLOOKUP(H3,$A$57:$C$65,2,FALSE)","v":"2017-11-18"},null,null,null,{"$f":"D3","v":1},{"$f":"E3","v":2},{"$f":"F3","v":3}]
[{"$f":"RANK(J5,$J$5:$J$39,0)","v":1},"Dick Ballantine",{"$f":"VLOOKUP(B5,'Age Cat'!F:G,2,FALSE)","v":"V50"},{"$f":"IFERROR(VLOOKUP($B5,'2017 extreme results'!$B$3:$D$14,3,FALSE),\"\")","v":23},{"$f":"IFERROR(VLOOKUP($B5,'2017 extreme results'!$B$22:$D$31,3,FALSE),\"\")","v":""},{"$f":"IFERROR(VLOOKUP($B5,'2017 extreme results'!$B$34:$D$49,3,FALSE),\"\")","v":12},{"$f":"IFERROR(VLOOKUP($B5,'2017 extreme results'!$B$53:$D$64,3,FALSE),\"\")","v":""},{"$f":"IFERROR(VLOOKUP($B5,'2017 extreme results'!$B$68:$D$79,3,FALSE),\"\")","v":""},{"$f":"IF(SUM(D5:H5)=0,\"\",SUM(D5:H5))","v":35},{"$f":"SUM(L5:N5)","v":35},{"$f":"IF(COUNT(D5:H5)=0,\"\",COUNT(D5:H5))","v":2},{"$f":"IFERROR(LARGE($D5:$H$5,D3),\"\")","v":23},{"$f":"IFERROR(LARGE($D5:$H$5,E3),\"\")","v":12},{"$f":"IFERROR(LARGE($D5:$H$5,F3),\"\")","v":""},{"$f":"COUNT(L5:N5)","v":2}]
[{"$f":"RANK(J6,$J$5:$J$39,0)","v":2},"Simon Wheeler",{"$f":"VLOOKUP(B6,'Age Cat'!F:G,2,FALSE)","v":"V40"},{"$f":"IFERROR(VLOOKUP($B6,'2017 extreme results'!$B$3:$D$14,3,FALSE),\"\")","v":20},{"$f":"IFERROR(VLOOKUP($B6,'2017 extreme results'!$B$22:$D$31,3,FALSE),\"\")","v":""},{"$f":"IFERROR(VLOOKUP($B6,'2017 extreme results'!$B$34:$D$49,3,FALSE),\"\")","v":10},{"$f":"IFERROR(VLOOKUP($B6,'2017 extreme results'!$B$53:$D$64,3,FALSE),\"\")","v":""},{"$f":"IFERROR(VLOOKUP($B6,'2017 extreme results'!$B$68:$D$79,3,FALSE),\"\")","v":""},{"$f":"IF(SUM(D6:H6)=0,\"\",SUM(D6:H6))","v":30},{"$f":"SUM(L6:N6)","v":30},{"$f":"IF(COUNT(D6:H6)=0,\"\",COUNT(D6:H6))","v":2},{"$f":"IFERROR(LARGE($D6:$H6,D$3),\"\")","v":20},{"$f":"IFERROR(LARGE($D6:$H6,E$3),\"\")","v":10},{"$f":"IFERROR(LARGE($D6:$H6,F$3),\"\")","v":""},{"$f":"COUNT(L6:N6)","v":2}]
{"$rows_left_out":56}
{"sheet":"2017 fell Table","index":3,"n_rows":48,"n_cols":24,"rows_kept":48,"cut":false,"hidden":false,"merged":[[38,3,38,11],[38,12,38,14],[49,1,49,13],[2,15,2,19],[29,0,30,0],[29,1,30,1],[29,12,30,12],[29,13,30,13],[29,14,30,14],[29,15,29,19],[2,14,3,14],[0,0,1,1],[2,0,3,0],[2,1,3,1],[2,12,3,12],[2,13,3,13]]}
["2017 - Fell\n(Best 5 of 9 Races)"]
[null,null,null,{"$f":"VLOOKUP(D3,$A$40:$C$48,3,FALSE)","v":"Hoofstones"},"Bleasdale Circle","Stan Bradshaw Pendle Round","Coledale Horseshoe","Oakworth Haul","Grisedale Horseshoe","Great Whernside","Mytholmroyd","Guisborough Wood"]
["Pos","Name",null,1,2,3,4,5,6,7,8,9,"Total","Scoring Total","# Races","Top 5 Results"]
[null,null,null,{"$f":"VLOOKUP(D3,$A$40:$C$48,2,FALSE)","v":"2017-01-28"},"2017-02-18","2017-03-04","2017-04-08","2017-07-01","2017-09-02","2017-09-23","2017-12-09","2017-12-27",null,null,null,{"$f":"D3","v":1},2,3,4,5]
[{"$f":"RANK(M5,$M$5:$M$18,0)","v":1},"John-Paul Hopkinson",{"$f":"VLOOKUP(B5,'Age Cat'!F:G,2,FALSE)","v":"V40"},{"$f":"IFERROR(VLOOKUP($B5,'2017 fell results'!$B$3:$D$14,3,FALSE),\"\")","v":25},{"$f":"IFERROR(VLOOKUP($B5,'2017 fell results'!$B$18:$D$29,3,FALSE),\"\")","v":24},{"$f":"IFERROR(VLOOKUP($B5,'2017 fell results'!$B$35:$D$52,3,FALSE),\"\")","v":24},{"$f":"IFERROR(VLOOKUP($B5,'2017 fell results'!$B$52:$D$63,3,FALSE),\"\")","v":23},{"$f":"IFERROR(VLOOKUP($B5,'2017 fell results'!$B$67:$D$78,3,FALSE),\"\")","v":""},{"$f":"IFERROR(VLOOKUP($B5,'2017 fell results'!$B$82:$D$93,3,FALSE),\"\")","v":""},{"$f":"IFERROR(VLOOKUP($B5,'2017 fell results'!$B$97:$D$108,3,FALSE),\"\")","v":""},{"$f":"IFERROR(VLOOKUP($B5,'2017 fell results'!$B$112:$D$123,3,FALSE),\"\")","v":""},{"$f":"IFERROR(VLOOKUP($B5,'2017 fell results'!$B$127:$D$138,3,FALSE),\"\")","v":""},{"$f":"IF(SUM(D5:L5)=0,\"\",SUM(D5:L5))","v":96},{"$f":"SUM(P5:T5)","v":96},{"$f":"IF(COUNT(D5:L5)=0,\"\",COUNT(D5:L5))","v":4},{"$f":"IFERROR(LARGE($D5:$L5,D$3),\"\")","v":25},{"$f":"IFERROR(LARGE($D5:$L5,E$3),\"\")","v":24},24,23,"",{"$f":"COUNT(P5:T5)","v":4}]
[{"$f":"RANK(M6,$M$5:$M$18,0)","v":2},"Paul Crabtree",{"$f":"VLOOKUP(B6,'Age Cat'!F:G,2,FALSE)","v":"V40"},{"$f":"IFERROR(VLOOKUP($B6,'2017 fell results'!$B$3:$D$14,3,FALSE),\"\")","v":22},{"$f":"IFERROR(VLOOKUP($B6,'2017 fell results'!$B$18:$D$29,3,FALSE),\"\")","v":23},{"$f":"IFERROR(VLOOKUP($B6,'2017 fell results'!$B$35:$D$52,3,FALSE),\"\")","v":25},{"$f":"IFERROR(VLOOKUP($B6,'2017 fell results'!$B$52:$D$63,3,FALSE),\"\")","v":25},{"$f":"IFERROR(VLOOKUP($B6,'2017 fell results'!$B$67:$D$78,3,FALSE),\"\")","v":""},{"$f":"IFERROR(VLOOKUP($B6,'2017 fell results'!$B$82:$D$93,3,FALSE),\"\")","v":""},{"$f":"IFERROR(VLOOKUP($B6,'2017 fell results'!$B$97:$D$108,3,FALSE),\"\")","v":""},{"$f":"IFERROR(VLOOKUP($B6,'2017 fell results'!$B$112:$D$123,3,FALSE),\"\")","v":""},{"$f":"IFERROR(VLOOKUP($B6,'2017 fell results'!$B$127:$D$138,3,FALSE),\"\")","v":""},95,95,4,25,25,23,22,"",4]
{"$rows_left_out":43}
{"sheet":"2017 xc Table","index":4,"n_rows":45,"n_cols":21,"rows_kept":45,"cut":false,"hidden":false,"merged":[[37,3,37,9],[37,10,37,12],[46,1,46,11],[2,13,2,16],[28,0,29,0],[28,1,29,1],[28,10,29,10],[28,11,29,11],[28,12,29,12],[28,13,28,16],[2,12,3,12],[0,0,1,1],[2,0,3,0],[2,1,3,1],[2,10,3,10],[2,11,3,11]]}
["2017 - xc\n(Best 4 of 7 Races)"]
[null,null,null,{"$f":"VLOOKUP(D3,$A$39:$C$45,3,FALSE)","v":"Yorkshire Champs"},"National Champs","Open Kross Challenge","1st WYXC Race","2nd WYXC Race","3rd WYXC Race","4th WYXC Race"]
["Pos","Name",null,1,2,3,4,5,6,7,"Total","Scoring Total","# Races","Top 4 Results"]
[null,null,null,{"$f":"VLOOKUP(D3,$A$39:$C$45,2,FALSE)","v":"Jan"},{"$f":"VLOOKUP(E3,$A$39:$C$45,2,FALSE)","v":"Feb"},null,{"$f":"VLOOKUP(G3,$A$39:$C$45,2,FALSE)","v":"Oct"},{"$f":"VLOOKUP(H3,$A$39:$C$45,2,FALSE)","v":"Oct"},{"$f":"VLOOKUP(I3,$A$39:$C$45,2,FALSE)","v":"Nov"},{"$f":"VLOOKUP(J3,$A$39:$C$45,2,FALSE)","v":"Dec"},null,null,null,{"$f":"D3","v":1},2,3,4]
[1,"Scott Bairstow",{"$f":"VLOOKUP(B5,'Age Cat'!F:G,2,FALSE)","v":"V40"},{"$f":"IFERROR(VLOOKUP($B5,'2017 xc results'!$B$3:$D$13,3,FALSE),\"\")","v":24},{"$f":"IFERROR(VLOOKUP($B5,'2017 xc results'!$B$17:$D$28,3,FALSE),\"\")","v":25},{"$f":"IFERROR(VLOOKUP($B5,'2017 xc results'!$B$34:$D$50,3,FALSE),\"\")","v":""},{"$f":"IFERROR(VLOOKUP($B5,'2017 xc results'!$B$50:$D$61,3,FALSE),\"\")","v":""},{"$f":"IFERROR(VLOOKUP($B5,'2017 xc results'!$B$65:$D$76,3,FALSE),\"\")","v":""},{"$f":"IFERROR(VLOOKUP($B5,'2017 xc results'!$B$80:$D$91,3,FALSE),\"\")","v":""},{"$f":"IFERROR(VLOOKUP($B5,'2017 xc results'!$B$95:$D$106,3,FALSE),\"\")","v":""},{"$f":"IF(SUM(D5:J5)=0,\"\",SUM(D5:J5))","v":49},{"$f":"SUM(N5:Q5)","v":49},{"$f":"IF(COUNT(D5:J5)=0,\"\",COUNT(D5:J5))","v":2},{"$f":"IFERROR(LARGE($D5:$J5,D$3),\"\")","v":25},{"$f":"IFERROR(LARGE($D5:$J5,E$3),\"\")","v":24},{"$f":"IFERROR(LARGE($D5:$J5,F$3),\"\")","v":""},{"$f":"IFERROR(LARGE($D5:$J5,H$3),\"\")","v":""},{"$f":"COUNT(N5:Q5)","v":2}]
[{"$f":"A5+1","v":2},"John Conroy",{"$f":"VLOOKUP(B6,'Age Cat'!F:G,2,FALSE)","v":"V40"},{"$f":"IFERROR(VLOOKUP($B6,'2017 xc results'!$B$3:$D$13,3,FALSE),\"\")","v":23},{"$f":"IFERROR(VLOOKUP($B6,'2017 xc results'!$B$17:$D$28,3,FALSE),\"\")","v":24},{"$f":"IFERROR(VLOOKUP($B6,'2017 xc results'!$B$34:$D$50,3,FALSE),\"\")","v":""},{"$f":"IFERROR(VLOOKUP($B6,'2017 xc results'!$B$50:$D$61,3,FALSE),\"\")","v":""},{"$f":"IFERROR(VLOOKUP($B6,'2017 xc results'!$B$65:$D$76,3,FALSE),\"\")","v":""},{"$f":"IFERROR(VLOOKUP($B6,'2017 xc results'!$B$80:$D$91,3,FALSE),\"\")","v":""},{"$f":"IFERROR(VLOOKUP($B6,'2017 xc results'!$B$95:$D$106,3,FALSE),\"\")","v":""},47,47,2,24,23,"","",2]
{"$rows_left_out":40}
{"sheet":"2017 Road Table","index":5,"n_rows":68,"n_cols":24,"rows_kept":68,"cut":false,"hidden":false,"merged":[[58,3,58,11],[58,12,58,14],[69,1,69,13],[2,15,2,19],[36,0,37,0],[36,1,37,1],[36,12,37,12],[36,13,37,13],[36,14,37,14],[36,15,36,19],[2,14,3,14],[0,0,1,1],[2,0,3,0],[2,1,3,1],[2,12,3,12],[2,13,3,13]]}
["2017 - Road\n(Best 5 of 9 Races)"]
[null,null,null,{"$f":"VLOOKUP(D3,$A$60:$C$68,3,FALSE)","v":"Bradford 10k"},"Esholt 5k Series (x3)","Bronte 5m","Helen Windsor 10K ","UAK Track 1M ","Burnsall 10M ","Holmfirth 10K ","Best ½ Marathon ","Best Marathon "]
["Pos","Name",null,1,2,3,4,5,6,7,8,9,"Total","Scoring Total","# Races","Top 5 Results"]
[null,null,null,{"$f":"VLOOKUP(D3,$A$60:$C$68,2,FALSE)","v":"2017-03-19"},"May","2017-06-08","2017-07-05","2017-08-03","2017-08-19","2017-10-29",null,null,null,null,null,{"$f":"D3","v":1},2,3,4,5]
[{"$f":"RANK(N5,$N$5:$N$35,0)","v":1},"Craig Cooper",{"$f":"VLOOKUP(B5,'Age Cat'!F:G,2,FALSE)","v":"V40"},{"$f":"IFERROR(VLOOKUP($B5,'2017 Road results'!$B$3:$D$22,3,FALSE),\"\")","v":25},null,null,null,null,null,null,{"$f":"IFERROR(VLOOKUP($B5,'2017 marathon & half'!$B$3:$D$14,3,FALSE),\"\")","v":""},{"$f":"IFERROR(VLOOKUP($B5,'2017 marathon & half'!$B$27:$D$42,3,FALSE),\"\")","v":23},{"$f":"IF(SUM(D5:L5)=0,\"\",SUM(D5:L5))","v":48},{"$f":"SUM(P5:T5)","v":48},{"$f":"IF(COUNT(D5:L5)=0,\"\",COUNT(D5:L5))","v":2},{"$f":"IFERROR(LARGE($D5:$L5,D$3),\"\")","v":25},{"$f":"IFERROR(LARGE($D5:$L5,E$3),\"\")","v":23},"","","",{"$f":"COUNT(P5:T5)","v":2}]
[{"$f":"RANK(N6,$N$5:$N$35,0)","v":1},"Tony Booth",{"$f":"VLOOKUP(B6,'Age Cat'!F:G,2,FALSE)","v":"V40"},{"$f":"IFERROR(VLOOKUP($B6,'2017 Road results'!$B$3:$D$22,3,FALSE),\"\")","v":""},null,null,null,null,null,null,{"$f":"IFERROR(VLOOKUP($B6,'2017 marathon & half'!$B$3:$D$14,3,FALSE),\"\")","v":24},{"$f":"IFERROR(VLOOKUP($B6,'2017 marathon & half'!$B$27:$D$42,3,FALSE),\"\")","v":24},48,{"$f":"SUM(P6:T6)","v":48},{"$f":"IF(COUNT(D6:L6)=0,\"\",COUNT(D6:L6))","v":2},24,{"$f":"IFERROR(LARGE($D6:$L6,E$3),\"\")","v":24},{"$f":"IFERROR(LARGE($D6:$L6,F$3),\"\")","v":""},{"$f":"IFERROR(LARGE($D6:$L6,G$3),\"\")","v":""},{"$f":"IFERROR(LARGE($D6:$L6,H$3),\"\")","v":""},{"$f":"COUNT(P6:T6)","v":2}]
{"$rows_left_out":63}
{"sheet":"2017 marathon & half","index":6,"n_rows":60,"n_cols":15,"rows_kept":60,"cut":false,"hidden":false,"merged":[]}
["Half Marathon Results",null,null,null,null,null,"Name","Fastest","Central Lancs","Wilmslow","Inskip","Oulton Park","Hastings","Keswick","Fleet"]
["Position","Name","Time","Points","in Road tbl","In Overall","John-Paul Hopkinson",{"$f":"MIN(I2:S2)","v":84.24},null,null,84.24]
[{"$f":"RANK(C3,$C$3:$C$13,1)","v":1},"John-Paul Hopkinson",{"$f":"VLOOKUP(B3,G:H,2,FALSE)","v":84.24},{"$f":"26-A3","v":25},{"$f":"VLOOKUP(B3,'2017 Road Table'!$B$3:$B$69,1,FALSE)","v":"John-Paul Hopkinson"},{"$f":"VLOOKUP(B3,'Overall Champs'!$C$7:$C$47,1,FALSE)","v":"John-Paul Hopkinson"},"Tracey Hodgson",{"$f":"MIN(I3:S3)","v":116.48},null,null,116.48,null,null,{"$f":"(2*60+4)","v":124}]
[{"$f":"RANK(C4,$C$3:$C$13,1)","v":2},"Tony Booth",{"$f":"VLOOKUP(B4,G:H,2,FALSE)","v":85.59},{"$f":"26-A4","v":24},{"$f":"VLOOKUP(B4,'2017 Road Table'!$B$3:$B$69,1,FALSE)","v":"Tony Booth"},{"$f":"VLOOKUP(B4,'Overall Champs'!$C$7:$C$47,1,FALSE)","v":"Tony Booth"},"Lorraine Bamfield",147.41,null,null,147.41]
[{"$f":"RANK(C5,$C$3:$C$13,1)","v":3},"John Conroy",{"$f":"VLOOKUP(B5,G:H,2,FALSE)","v":89.54},{"$f":"26-A5","v":23},{"$f":"VLOOKUP(B5,'2017 Road Table'!$B$3:$B$69,1,FALSE)","v":"John Conroy"},{"$f":"VLOOKUP(B5,'Overall Champs'!$C$7:$C$47,1,FALSE)","v":"John Conroy"},"Joe Atherton",92.32,null,92.32]
[{"$f":"RANK(C6,$C$3:$C$13,1)","v":4},"Joe Atherton",{"$f":"VLOOKUP(B6,G:H,2,FALSE)","v":92.32},{"$f":"26-A6","v":22},{"$f":"VLOOKUP(B6,'2017 Road Table'!$B$3:$B$69,1,FALSE)","v":"Joe Atherton"},{"$f":"VLOOKUP(B6,'Overall Champs'!$C$7:$C$47,1,FALSE)","v":"Joe Atherton"},"Donna Chester",113.29,113.29]
{"$rows_left_out":55}
{"sheet":"2017 extreme results","index":7,"n_rows":87,"n_cols":11,"rows_kept":87,"cut":false,"hidden":false,"merged":[]}
["Race 1 ","Rombalds"]
["Position","Name","lookup","Points","overall champs lookup","overall champs lookup","Club","Cat","Time","Comment ","overall champs lookup"]
[1,"John-Paul Hopkinson",{"$f":"VLOOKUP(B3,'2017 extreme Table'!$B$3:$B$76,1,FALSE)","v":"John-Paul Hopkinson"},{"$f":"26-A3","v":25},{"$f":"VLOOKUP(B3,'Overall Champs'!C:C,1,FALSE)","v":"John-Paul Hopkinson"},{"$f":"VLOOKUP(B3,'Overall Champs'!O:O,1,FALSE)","v":{"$error":"#N/A"}},null,null,"03:18:18"]
[2,"Richard Butter",{"$f":"VLOOKUP(B4,'2017 extreme Table'!$B$3:$B$76,1,FALSE)","v":{"$error":"#N/A"}},{"$f":"26-A4","v":24},{"$f":"VLOOKUP(B4,'Overall Champs'!C:C,1,FALSE)","v":"Richard Butter"},{"$f":"VLOOKUP(B4,'Overall Champs'!O:O,1,FALSE)","v":{"$error":"#N/A"}},null,null,"03:40:08"]
[3,"Dick Ballantine",{"$f":"VLOOKUP(B5,'2017 extreme Table'!$B$3:$B$76,1,FALSE)","v":"Dick Ballantine"},23,{"$f":"VLOOKUP(B5,'Overall Champs'!C:C,1,FALSE)","v":"Dick Ballantine"},{"$f":"VLOOKUP(B5,'Overall Champs'!O:O,1,FALSE)","v":{"$error":"#N/A"}},null,null,"03:49:43"]
[4,"Simon Bellwood ",{"$f":"VLOOKUP(B6,'2017 extreme Table'!$B$3:$B$76,1,FALSE)","v":"Simon Bellwood "},22,{"$f":"VLOOKUP(B6,'Overall Champs'!C:C,1,FALSE)","v":"Simon Bellwood "},{"$f":"VLOOKUP(B6,'Overall Champs'!O:O,1,FALSE)","v":{"$error":"#N/A"}},null,null,"03:59:57"]
{"$rows_left_out":82}
{"sheet":"2017 fell results","index":8,"n_rows":138,"n_cols":6,"rows_kept":138,"cut":false,"hidden":false,"merged":[]}
["Race 1 Hoofstones","Hoofstones"]
["Position","Name",null,"Points","overall champs lookup male","overall champs lookup female"]
[1,"John-Paul Hopkinson",{"$f":"VLOOKUP(B3,'2017 fell Table'!$B$3:$B$61,1,FALSE)","v":"John-Paul Hopkinson"},{"$f":"26-A3","v":25},{"$f":"VLOOKUP(B3,'Overall Champs'!C:C,1,FALSE)","v":"John-Paul Hopkinson"},{"$f":"VLOOKUP(B3,'Overall Champs'!O:O,1,FALSE)","v":{"$error":"#N/A"}}]
[2,"Ian Willis",{"$f":"VLOOKUP(B4,'2017 fell Table'!$B$3:$B$61,1,FALSE)","v":"Ian Willis"},{"$f":"26-A4","v":24},{"$f":"VLOOKUP(B4,'Overall Champs'!C:C,1,FALSE)","v":"Ian Willis"},{"$f":"VLOOKUP(B4,'Overall Champs'!O:O,1,FALSE)","v":{"$error":"#N/A"}}]
[3,"Alfie Walker",{"$f":"VLOOKUP(B5,'2017 fell Table'!$B$3:$B$61,1,FALSE)","v":"Alfie Walker"},23,{"$f":"VLOOKUP(B5,'Overall Champs'!C:C,1,FALSE)","v":"Alfie Walker"},{"$f":"VLOOKUP(B5,'Overall Champs'!O:O,1,FALSE)","v":{"$error":"#N/A"}}]
[4,"Paul Crabtree",{"$f":"VLOOKUP(B6,'2017 fell Table'!$B$3:$B$61,1,FALSE)","v":"Paul Crabtree"},22,{"$f":"VLOOKUP(B6,'Overall Champs'!C:C,1,FALSE)","v":"Paul Crabtree"},{"$f":"VLOOKUP(B6,'Overall Champs'!O:O,1,FALSE)","v":{"$error":"#N/A"}}]
{"$rows_left_out":133}
{"sheet":"2017 Road results","index":9,"n_rows":23,"n_cols":17,"rows_kept":23,"cut":false,"hidden":false,"merged":[]}
["Race 1 ","Bradford 10k"]
["Position","Name","table look up","Points","overall champs lookup male","overall champs lookup female"]
[1,"Craig Cooper",{"$f":"VLOOKUP(B3,'2017 Road Table'!$B$3:$B$58,1,FALSE)","v":"Craig Cooper"},{"$f":"26-A3","v":25},{"$f":"VLOOKUP(B3,'Overall Champs'!C:C,1,FALSE)","v":"Craig Cooper"},{"$f":"VLOOKUP(B3,'Overall Champs'!O:O,1,FALSE)","v":{"$error":"#N/A"}},null,1925,"Craig Cooper","Male","M40","Keighley & Craven AC","00:40:25","00:40:23",43,11,50]
[1,"Tizz Woffenden",{"$f":"VLOOKUP(B4,'2017 Road Table'!$B$3:$B$58,1,FALSE)","v":"Tizz Woffenden"},25,{"$f":"VLOOKUP(B4,'Overall Champs'!C:C,1,FALSE)","v":{"$error":"#N/A"}},{"$f":"VLOOKUP(B4,'Overall Champs'!O:O,1,FALSE)","v":"Tizz Woffenden"},null,1721,"Elisa Woffenden","Female","F40","Keighley & Craven AC","00:41:10","00:41:06",8,3,66]
[2,"Sarah O'Sullivan",{"$f":"VLOOKUP(B5,'2017 Road Table'!$B$3:$B$58,1,FALSE)","v":"Sarah O'Sullivan"},24,{"$f":"VLOOKUP(B5,'Overall Champs'!C:C,1,FALSE)","v":{"$error":"#N/A"}},{"$f":"VLOOKUP(B5,'Overall Champs'!O:O,1,FALSE)","v":"Sarah O'Sullivan"},null,964,"Sarah O'Sullivan","Female","F40","Keighley & Craven AC","00:43:14","00:43:11",14,6,125]
[2,"Chris Tomes",{"$f":"VLOOKUP(B6,'2017 Road Table'!$B$3:$B$58,1,FALSE)","v":"Chris Tomes"},24,{"$f":"VLOOKUP(B6,'Overall Champs'!C:C,1,FALSE)","v":"Chris Tomes"},{"$f":"VLOOKUP(B6,'Overall Champs'!O:O,1,FALSE)","v":{"$error":"#N/A"}},null,1084,"Chris Tomes","Male","M60","Keighley & Craven AC","00:43:19","00:43:16",109,6,133]
{"$rows_left_out":18}
{"sheet":"2017 xc results","index":10,"n_rows":136,"n_cols":6,"rows_kept":136,"cut":false,"hidden":false,"merged":[]}
["Race 1 Yorkshire"]
["Position","Name",null,"Points","overall champs lookup","overall champs lookup"]
[1,"Ian Willis",{"$f":"VLOOKUP(B3,'2017 xc Table'!$B$3:$B$60,1,FALSE)","v":"Ian Willis"},{"$f":"26-A3","v":25},{"$f":"VLOOKUP(B3,'Overall Champs'!C:C,1,FALSE)","v":"Ian Willis"},{"$f":"VLOOKUP(B3,'Overall Champs'!O:O,1,FALSE)","v":{"$error":"#N/A"}}]
[2,"Scott Bairstow",{"$f":"VLOOKUP(B4,'2017 xc Table'!$B$3:$B$60,1,FALSE)","v":"Scott Bairstow"},24,{"$f":"VLOOKUP(B4,'Overall Champs'!C:C,1,FALSE)","v":"Scott Bairstow"},{"$f":"VLOOKUP(B4,'Overall Champs'!O:O,1,FALSE)","v":{"$error":"#N/A"}}]
[3,"John Conroy",{"$f":"VLOOKUP(B5,'2017 xc Table'!$B$3:$B$60,1,FALSE)","v":"John Conroy"},23,{"$f":"VLOOKUP(B5,'Overall Champs'!C:C,1,FALSE)","v":"John Conroy"},{"$f":"VLOOKUP(B5,'Overall Champs'!O:O,1,FALSE)","v":{"$error":"#N/A"}}]
[1,"Tizz Woffenden",{"$f":"VLOOKUP(B6,'2017 xc Table'!$B$3:$B$60,1,FALSE)","v":"Tizz Woffenden"},25,{"$f":"VLOOKUP(B6,'Overall Champs'!C:C,1,FALSE)","v":{"$error":"#N/A"}},{"$f":"VLOOKUP(B6,'Overall Champs'!O:O,1,FALSE)","v":"Tizz Woffenden"}]
{"$rows_left_out":131}
{"sheet":"Age Cat","index":11,"n_rows":260,"n_cols":8,"rows_kept":260,"cut":false,"hidden":false,"merged":[]}
[]
[null,null,null,null,null,"Abigail Knowles","J"]
[null,null,null,null,null,"Adie Greenwood","V50"]
[null,null,null,null,null,"Adrian Dunbar","V60"]
[null,null,null,null,null,"Adrian Thomas","V40"]
[null,null,null,null,null,"Adrienne Preston","V40"]
{"$rows_left_out":254}