{"text_format":"1","workbook":"xlsx","n_sheets":12,"sheets":["Events","Overall Champs","2017 extreme Table","2017 fell Table","2017 xc Table","2017 Road Table","2017 marathon & half","2017 extreme results","2017 fell results","2017 Road results","2017 xc results","Age Cat"],"not_rendered":{"charts":0,"images":1,"macros":1,"external_links":1,"defined_names":10,"comments":4,"pivot_tables":0},"unopened":[],"bounds":{"document_bytes":16777216,"sheet_cells":100000,"rows_first":2000,"rows_last":500,"rows_between":2000,"halvings":0,"cell_chars":16384,"cell_head_chars":4096},"cells_cut":0,"cells_raw":0,"read":"whole","date_system":"1900"}

{"sheet":"Events","index":0,"n_rows":13,"n_cols":5,"rows_kept":13,"cut":false,"hidden":false,"merged":[]}
[]
[]
["FELL CHAMPIONSHIPS 2017","ROAD CHAMPIONSHIPS 2017","EXTREME CHAMPIONSHIPS 2017","XC CHAMPIONSHIPS 2017","ALL ROUND CHAMPIONSHIPS 2017"]
["(Best 5 of 9)","(Best 5 of 9)","Best 3 of 5)","(Best 4 of 7)","(Best 5 races to qualify)"]
["Jan 28th Hoofstones 8M BM","Mar 19th Bradford 10K ","Feb 4th Rombald Stride 23M ","Jan17 Yorkshire Champs ","Best 2 Fell"]
["Feb 18th Bleasdale Circle 5M AS ","May 3/10/17thEsholt (Series) 5K YVAA","Apr 29th 3 Peaks 23.2M AL ","Feb17 National Champs ","Best 2 Road"]
["Mar 4th Stan Bradshaw Pendle Round 10.4M BM ","June 8th Bronte 5 5M YVAA","June 10th Ennerdale 22.9M AL ","Any (best) Open Kross Challenge ","Best XC Or Best Extreme"]
["Apr 8th Coledale Horseshoe 8.5M AM ","July 5th Helen Windsor 10K ","Aug 5th Borrowdale 16.8M AL ","Oct17 1st WYXC Race "]
["July 2nd Oakworth Haul 5.6M","Aug 3rd UAK Track 1M ","Nov 18th Full Tour of Pendle 16.8M AL ","Oct17 2nd WYXC Race "]
["Sept 2nd Grisedale Horseshoe 9.9M AM ","Aug 19th Burnsall 10M ",null,"Nov17 3rd WYXC Race "]
["Sept 23rd Great Whernside 4M AS","Oct 29th Holmfirth 10K ",null,"Dec17 4th WYXC Race "]
["Dec 9th Mytholmroyd 6M AS ","Best ½ Marathon "]
["Dec 27th Guisborough Wood 5.5M BS ","Best Marathon "]

{"sheet":"Overall Champs","index":1,"n_rows":47,"n_cols":24,"rows_kept":47,"cut":false,"hidden":false,"merged":[[47,5,47,10],[58,2,58,11],[5,9,5,10],[4,9,4,10],[4,23,5,23],[4,21,4,22],[5,21,5,22],[2,20,2,23],[1,1,3,2],[4,1,5,1],[4,2,5,2],[4,11,5,11],[1,5,1,19],[4,13,5,13],[4,14,5,14]]}
[]
[]
[null,null,null,null,null,null,null,null,null,null,null,null,null,null,null,null,null,null,null,null,{"$f":"TODAY()","v":"2017-05-11"}]
[null,null,null,null,null,"Best Road","2nd Best Road","Best Fell","2nd Best Fell","Best Cross Country","Best Extreme",null,null,null,null,null,null,{"$f":"F4","v":"Best Road"},"2nd Best Road","Best Fell","2nd Best Fell","Best Cross Country","Best Extreme"]
[null,"Pos","Name",null,null,1,2,3,4,5,null,"Scoring Total",null,"Pos","Name",null,null,1,2,3,4,5,null,"Scoring Total"]
[null,null,null,null,null,null,null,null,null,"(Best Score Counts)",null,null,null,null,null,null,null,null,null,null,null,"(Best Score Counts)"]
[null,{"$f":"RANK(L7,$L$7:$L$47,0)","v":1},"John-Paul Hopkinson","M",{"$f":"VLOOKUP($C7,'Age Cat'!F:G,2,FALSE)","v":"V40"},{"$f":"IFERROR(VLOOKUP($C7,'2017 Road Table'!$B$3:$T$100,15,FALSE),\"\")","v":25},{"$f":"IFERROR(VLOOKUP($C7,'2017 Road Table'!$B$3:$T$100,16,FALSE),\"\")","v":""},{"$f":"IFERROR(VLOOKUP($C7,'2017 fell Table'!$B$3:$T$101,15,FALSE),\"\")","v":25},{"$f":"IFERROR(VLOOKUP(C7,'2017 fell Table'!$B$3:$T$101,16,FALSE),\"\")","v":24},null,{"$f":"IFERROR(VLOOKUP(C7,'2017 extreme Table'!$B$3:$T$114,11,FALSE),\"\")","v":25},{"$f":"SUM(F7:I7)+MAX(J7:K7)","v":99},null,{"$f":"RANK(X7,$X$7:$X$37,0)","v":1},"Tracey Hodgson","F",{"$f":"VLOOKUP($O7,'Age Cat'!F:G,2,FALSE)","v":"V30"},{"$f":"IFERROR(VLOOKUP($O7,'2017 Road Table'!$B$3:$T$100,15,FALSE),\"\")","v":22},{"$f":"IFERROR(VLOOKUP($O7,'2017 Road Table'!$B$3:$T$100,16,FALSE),\"\")","v":18},{"$f":"IFERROR(VLOOKUP($O7,'2017 fell Table'!$B$3:$T$101,15,FALSE),\"\")","v":24},{"$f":"IFERROR(VLOOKUP(O7,'2017 fell Table'!$B$3:$T$101,16,FALSE),\"\")","v":24},{"$f":"IFERROR(VLOOKUP(O7,'2017 xc Table'!$B$3:$T$100,13,FALSE),\"\")","v":""},{"$f":"IFERROR(VLOOKUP(O7,'2017 extreme Table'!$B$3:$T$114,11,FALSE),\"\")","v":""},{"$f":"SUM(R7:U7)+MAX(V7:W7)","v":88}]
[null,{"$f":"RANK(L8,$L$7:$L$47,0)","v":2},"John Conroy","M",{"$f":"VLOOKUP($C8,'Age Cat'!F:G,2,FALSE)","v":"V40"},{"$f":"IFERROR(VLOOKUP($C8,'2017 Road Table'!$B$3:$T$100,15,FALSE),\"\")","v":23},{"$f":"IFERROR(VLOOKUP($C8,'2017 Road Table'!$B$3:$T$100,16,FALSE),\"\")","v":""},{"$f":"IFERROR(VLOOKUP($C8,'2017 fell Table'!$B$3:$T$101,15,FALSE),\"\")","v":21},{"$f":"IFERROR(VLOOKUP(C8,'2017 fell Table'!$B$3:$T$101,16,FALSE),\"\")","v":20},{"$f":"IFERROR(VLOOKUP(C8,'2017 xc Table'!$B$3:$T$100,13,FALSE),\"\")","v":24},{"$f":"IFERROR(VLOOKUP(C8,'2017 extreme Table'!$B$3:$T$114,11,FALSE),\"\")","v":20},{"$f":"SUM(F8:I8)+MAX(J8:K8)","v":88},null,{"$f":"RANK(X8,$X$7:$X$37,0)","v":2},"Hannah Thom","F",{"$f":"VLOOKUP($O8,'Age Cat'!F:G,2,FALSE)","v":"S"},{"$f":"IFERROR(VLOOKUP($O8,'2017 Road Table'!$B$3:$T$100,15,FALSE),\"\")","v":""},{"$f":"IFERROR(VLOOKUP($O8,'2017 Road Table'!$B$3:$T$100,16,FALSE),\"\")","v":""},{"$f":"IFERROR(VLOOKUP($O8,'2017 fell Table'!$B$3:$T$101,15,FALSE),\"\")","v":25},{"$f":"IFERROR(VLOOKUP(O8,'2017 fell Table'!$B$3:$T$101,16,FALSE),\"\")","v":24},{"$f":"IFERROR(VLOOKUP(O8,'2017 xc Table'!$B$3:$T$100,13,FALSE),\"\")","v":""},{"$f":"IFERROR(VLOOKUP(O8,'2017 extreme Table'!$B$3:$T$114,11,FALSE),\"\")","v":22},71]
[null,{"$f":"RANK(L9,$L$7:$L$47,0)","v":3},"Ian Willis","M",{"$f":"VLOOKUP($C9,'Age Cat'!F:G,2,FALSE)","v":"V40"},{"$f":"IFERROR(VLOOKUP($C9,'2017 Road Table'!$B$3:$T$100,15,FALSE),\"\")","v":""},{"$f":"IFERROR(VLOOKUP($C9,'2017 Road Table'!$B$3:$T$100,16,FALSE),\"\")","v":""},{"$f":"IFERROR(VLOOKUP($C9,'2017 fell Table'!$B$3:$T$101,15,FALSE),\"\")","v":25},{"$f":"IFERROR(VLOOKUP(C9,'2017 fell Table'!$B$3:$T$101,16,FALSE),\"\")","v":24},{"$f":"IFERROR(VLOOKUP(C9,'2017 xc Table'!$B$3:$T$100,13,FALSE),\"\")","v":25},{"$f":"IFERROR(VLOOKUP(C9,'2017 extreme Table'!$B$3:$T$114,11,FALSE),\"\")","v":""},74,null,{"$f":"RANK(X9,$X$7:$X$37,0)","v":3},"Hannah Yates","F",{"$f":"VLOOKUP($O9,'Age Cat'!F:G,2,FALSE)","v":"S"},{"$f":"IFERROR(VLOOKUP($O9,'2017 Road Table'!$B$3:$T$100,15,FALSE),\"\")","v":24},{"$f":"IFERROR(VLOOKUP($O9,'2017 Road Table'!$B$3:$T$100,16,FALSE),\"\")","v":22},{"$f":"IFERROR(VLOOKUP($O9,'2017 fell Table'!$B$3:$T$101,15,FALSE),\"\")","v":""},{"$f":"IFERROR(VLOOKUP(O9,'2017 fell Table'!$B$3:$T$101,16,FALSE),\"\")","v":""},{"$f":"IFERROR(VLOOKUP(O9,'2017 xc Table'!$B$3:$T$100,13,FALSE),\"\")","v":""},{"$f":"IFERROR(VLOOKUP(O9,'2017 extreme Table'!$B$3:$T$114,11,FALSE),\"\")","v":24},70]
[null,{"$f":"RANK(L10,$L$7:$L$47,0)","v":4},"Richard Butter","M",{"$f":"VLOOKUP($C10,'Age Cat'!F:G,2,FALSE)","v":"V40"},{"$f":"IFERROR(VLOOKUP($C10,'2017 Road Table'!$B$3:$T$100,15,FALSE),\"\")","v":22},{"$f":"IFERROR(VLOOKUP($C10,'2017 Road Table'!$B$3:$T$100,16,FALSE),\"\")","v":""},{"$f":"IFERROR(VLOOKUP($C10,'2017 fell Table'!$B$3:$T$101,15,FALSE),\"\")","v":20},{"$f":"IFERROR(VLOOKUP(C10,'2017 fell Table'!$B$3:$T$101,16,FALSE),\"\")","v":19},{"$f":"IFERROR(VLOOKUP(C10,'2017 xc Table'!$B$3:$T$100,13,FALSE),\"\")","v":""},{"$f":"IFERROR(VLOOKUP(C10,'2017 extreme Table'!$B$3:$T$114,11,FALSE),\"\")","v":""},61,null,{"$f":"RANK(X10,$X$7:$X$37,0)","v":3},"Amanda Sterling","F",{"$f":"VLOOKUP($O10,'Age Cat'!F:G,2,FALSE)","v":"V40"},{"$f":"IFERROR(VLOOKUP($O10,'2017 Road Table'!$B$3:$T$100,15,FALSE),\"\")","v":24},{"$f":"IFERROR(VLOOKUP($O10,'2017 Road Table'!$B$3:$T$100,16,FALSE),\"\")","v":23},{"$f":"IFERROR(VLOOKUP($O10,'2017 fell Table'!$B$3:$T$101,15,FALSE),\"\")","v":""},{"$f":"IFERROR(VLOOKUP(O10,'2017 fell Table'!$B$3:$T$101,16,FALSE),\"\")","v":""},{"$f":"IFERROR(VLOOKUP(O10,'2017 xc Table'!$B$3:$T$100,13,FALSE),\"\")","v":""},{"$f":"IFERROR(VLOOKUP(O10,'2017 extreme Table'!$B$3:$T$114,11,FALSE),\"\")","v":23},70]
[null,{"$f":"RANK(L11,$L$7:$L$47,0)","v":4},"Peter Lloyd","M",{"$f":"VLOOKUP($C11,'Age Cat'!F:G,2,FALSE)","v":"V30"},{"$f":"IFERROR(VLOOKUP($C11,'2017 Road Table'!$B$3:$T$100,15,FALSE),\"\")","v":""},{"$f":"IFERROR(VLOOKUP($C11,'2017 Road Table'!$B$3:$T$100,16,FALSE),\"\")","v":""},{"$f":"IFERROR(VLOOKUP($C11,'2017 fell Table'!$B$3:$T$101,15,FALSE),\"\")","v":22},{"$f":"IFERROR(VLOOKUP(C11,'2017 fell Table'!$B$3:$T$101,16,FALSE),\"\")","v":20},{"$f":"IFERROR(VLOOKUP(C11,'2017 xc Table'!$B$3:$T$100,13,FALSE),\"\")","v":""},{"$f":"IFERROR(VLOOKUP(C11,'2017 extreme Table'!$B$3:$T$114,11,FALSE),\"\")","v":19},61,null,{"$f":"RANK(X11,$X$7:$X$37,0)","v":5},"Tizz Woffenden","F","S",{"$f":"IFERROR(VLOOKUP($O11,'2017 Road Table'!$B$3:$T$100,15,FALSE),\"\")","v":25},{"$f":"IFERROR(VLOOKUP($O11,'2017 Road Table'!$B$3:$T$100,16,FALSE),\"\")","v":""},{"$f":"IFERROR(VLOOKUP($O11,'2017 fell Table'!$B$3:$T$101,15,FALSE),\"\")","v":""},{"$f":"IFERROR(VLOOKUP(O11,'2017 fell Table'!$B$3:$T$101,16,FALSE),\"\")","v":""},{"$f":"IFERROR(VLOOKUP(O11,'2017 xc Table'!$B$3:$T$100,13,FALSE),\"\")","v":25},{"$f":"IFERROR(VLOOKUP(O11,'2017 extreme Table'!$B$3:$T$114,11,FALSE),\"\")","v":""},50]
[null,{"$f":"RANK(L12,$L$7:$L$47,0)","v":6},"Scott Bairstow","M",{"$f":"VLOOKUP($C12,'Age Cat'!F:G,2,FALSE)","v":"V40"},{"$f":"IFERROR(VLOOKUP($C12,'2017 Road Table'!$B$3:$T$100,15,FALSE),\"\")","v":""},{"$f":"IFERROR(VLOOKUP($C12,'2017 Road Table'!$B$3:$T$100,16,FALSE),\"\")","v":""},{"$f":"IFERROR(VLOOKUP($C12,'2017 fell Table'!$B$3:$T$101,15,FALSE),\"\")","v":25},{"$f":"IFERROR(VLOOKUP(C12,'2017 fell Table'!$B$3:$T$101,16,FALSE),\"\")","v":""},{"$f":"IFERROR(VLOOKUP(C12,'2017 xc Table'!$B$3:$T$100,13,FALSE),\"\")","v":25},{"$f":"IFERROR(VLOOKUP(C12,'2017 extreme Table'!$B$3:$T$114,11,FALSE),\"\")","v":""},{"$f":"SUM(F12:I12)+MAX(J12:K12)","v":50},null,{"$f":"RANK(X12,$X$7:$X$37,0)","v":5},"Hilary Barber","F",{"$f":"VLOOKUP($O12,'Age Cat'!F:G,2,FALSE)","v":"V50"},{"$f":"IFERROR(VLOOKUP($O12,'2017 Road Table'!$B$3:$T$100,15,FALSE),\"\")","v":""},{"$f":"IFERROR(VLOOKUP($O12,'2017 Road Table'!$B$3:$T$100,16,FALSE),\"\")","v":""},{"$f":"IFERROR(VLOOKUP($O12,'2017 fell Table'!$B$3:$T$101,15,FALSE),\"\")","v":25},{"$f":"IFERROR(VLOOKUP(O12,'2017 fell Table'!$B$3:$T$101,16,FALSE),\"\")","v":25},{"$f":"IFERROR(VLOOKUP(O12,'2017 xc Table'!$B$3:$T$100,13,FALSE),\"\")","v":""},{"$f":"IFERROR(VLOOKUP(O12,'2017 extreme Table'!$B$3:$T$114,11,FALSE),\"\")","v":""},50]
[null,{"$f":"RANK(L13,$L$7:$L$47,0)","v":6},"Paul Crabtree","M",{"$f":"VLOOKUP($C13,'Age Cat'!F:G,2,FALSE)","v":"V40"},{"$f":"IFERROR(VLOOKUP($C13,'2017 Road Table'!$B$3:$T$100,15,FALSE),\"\")","v":""},{"$f":"IFERROR(VLOOKUP($C13,'2017 Road Table'!$B$3:$T$100,16,FALSE),\"\")","v":""},{"$f":"IFERROR(VLOOKUP($C13,'2017 fell Table'!$B$3:$T$101,15,FALSE),\"\")","v":25},{"$f":"IFERROR(VLOOKUP(C13,'2017 fell Table'!$B$3:$T$101,16,FALSE),\"\")","v":25},{"$f":"IFERROR(VLOOKUP(C13,'2017 xc Table'!$B$3:$T$100,13,FALSE),\"\")","v":""},{"$f":"IFERROR(VLOOKUP(C13,'2017 extreme Table'!$B$3:$T$114,11,FALSE),\"\")","v":""},50,null,{"$f":"RANK(X13,$X$7:$X$37,0)","v":7},"Claire Cooper","F",{"$f":"VLOOKUP($O13,'Age Cat'!F:G,2,FALSE)","v":"V30"},{"$f":"IFERROR(VLOOKUP($O13,'2017 Road Table'!$B$3:$T$100,15,FALSE),\"\")","v":25},{"$f":"IFERROR(VLOOKUP($O13,'2017 Road Table'!$B$3:$T$100,16,FALSE),\"\")","v":""},{"$f":"IFERROR(VLOOKUP($O13,'2017 fell Table'!$B$3:$T$101,15,FALSE),\"\")","v":""},{"$f":"IFERROR(VLOOKUP(O13,'2017 fell Table'!$B$3:$T$101,16,FALSE),\"\")","v":""},{"$f":"IFERROR(VLOOKUP(O13,'2017 xc Table'!$B$3:$T$100,13,FALSE),\"\")","v":24},{"$f":"IFERROR(VLOOKUP(O13,'2017 extreme Table'!$B$3:$T$114,11,FALSE),\"\")","v":""},49]
[null,{"$f":"RANK(L14,$L$7:$L$47,0)","v":6},"Tim Thom","M",{"$f":"VLOOKUP($C14,'Age Cat'!F:G,2,FALSE)","v":"V50"},{"$f":"IFERROR(VLOOKUP($C14,'2017 Road Table'!$B$3:$T$100,15,FALSE),\"\")","v":""},{"$f":"IFERROR(VLOOKUP($C14,'2017 Road Table'!$B$3:$T$100,16,FALSE),\"\")","v":""},{"$f":"IFERROR(VLOOKUP($C14,'2017 fell Table'!$B$3:$T$101,15,FALSE),\"\")","v":21},{"$f":"IFERROR(VLOOKUP(C14,'2017 fell Table'!$B$3:$T$101,16,FALSE),\"\")","v":18},{"$f":"IFERROR(VLOOKUP(C14,'2017 xc Table'!$B$3:$T$100,13,FALSE),\"\")","v":""},{"$f":"IFERROR(VLOOKUP(C14,'2017 extreme Table'!$B$3:$T$114,11,FALSE),\"\")","v":11},50,null,{"$f":"RANK(X14,$X$7:$X$37,0)","v":8},"Sue Straw","F",{"$f":"VLOOKUP($O14,'Age Cat'!F:G,2,FALSE)","v":"V40"},{"$f":"IFERROR(VLOOKUP($O14,'2017 Road Table'!$B$3:$T$100,15,FALSE),\"\")","v":25},{"$f":"IFERROR(VLOOKUP($O14,'2017 Road Table'!$B$3:$T$100,16,FALSE),\"\")","v":23},{"$f":"IFERROR(VLOOKUP($O14,'2017 fell Table'!$B$3:$T$101,15,FALSE),\"\")","v":""},{"$f":"IFERROR(VLOOKUP(O14,'2017 fell Table'!$B$3:$T$101,16,FALSE),\"\")","v":""},{"$f":"IFERROR(VLOOKUP(O14,'2017 xc Table'!$B$3:$T$100,13,FALSE),\"\")","v":""},{"$f":"IFERROR(VLOOKUP(O14,'2017 extreme Table'!$B$3:$T$114,11,FALSE),\"\")","v":""},48]
[null,{"$f":"RANK(L15,$L$7:$L$47,0)","v":9},"Craig Cooper","M",{"$f":"VLOOKUP($C15,'Age Cat'!F:G,2,FALSE)","v":"V40"},{"$f":"IFERROR(VLOOKUP($C15,'2017 Road Table'!$B$3:$T$100,15,FALSE),\"\")","v":25},{"$f":"IFERROR(VLOOKUP($C15,'2017 Road Table'!$B$3:$T$100,16,FALSE),\"\")","v":23},{"$f":"IFERROR(VLOOKUP($C15,'2017 fell Table'!$B$3:$T$101,15,FALSE),\"\")","v":""},{"$f":"IFERROR(VLOOKUP(C15,'2017 fell Table'!$B$3:$T$101,16,FALSE),\"\")","v":""},{"$f":"IFERROR(VLOOKUP(C15,'2017 xc Table'!$B$3:$T$100,13,FALSE),\"\")","v":""},{"$f":"IFERROR(VLOOKUP(C15,'2017 extreme Table'!$B$3:$T$114,11,FALSE),\"\")","v":""},48,null,{"$f":"RANK(X15,$X$7:$X$37,0)","v":9},"Sarah O'Sullivan","F",{"$f":"VLOOKUP($O15,'Age Cat'!F:G,2,FALSE)","v":"V40"},{"$f":"IFERROR(VLOOKUP($O15,'2017 Road Table'!$B$3:$T$100,15,FALSE),\"\")","v":24},{"$f":"IFERROR(VLOOKUP($O15,'2017 Road Table'!$B$3:$T$100,16,FALSE),\"\")","v":""},{"$f":"IFERROR(VLOOKUP($O15,'2017 fell Table'!$B$3:$T$101,15,FALSE),\"\")","v":""},{"$f":"IFERROR(VLOOKUP(O15,'2017 fell Table'!$B$3:$T$101,16,FALSE),\"\")","v":""},{"$f":"IFERROR(VLOOKUP(O15,'2017 xc Table'!$B$3:$T$100,13,FALSE),\"\")","v":23},{"$f":"IFERROR(VLOOKUP(O15,'2017 extreme Table'!$B$3:$T$114,11,FALSE),\"\")","v":""},47]
[null,{"$f":"RANK(L16,$L$7:$L$47,0)","v":9},"Tony Booth","M",{"$f":"VLOOKUP($C16,'Age Cat'!F:G,2,FALSE)","v":"V40"},{"$f":"IFERROR(VLOOKUP($C16,'2017 Road Table'!$B$3:$T$100,15,FALSE),\"\")","v":24},{"$f":"IFERROR(VLOOKUP($C16,'2017 Road Table'!$B$3:$T$100,16,FALSE),\"\")","v":24},{"$f":"IFERROR(VLOOKUP($C16,'2017 fell Table'!$B$3:$T$101,15,FALSE),\"\")","v":""},{"$f":"IFERROR(VLOOKUP(C16,'2017 fell Table'!$B$3:$T$101,16,FALSE),\"\")","v":""},{"$f":"IFERROR(VLOOKUP(C16,'2017 xc Table'!$B$3:$T$100,13,FALSE),\"\")","v":""},{"$f":"IFERROR(VLOOKUP(C16,'2017 extreme Table'!$B$3:$T$114,11,FALSE),\"\")","v":""},48,null,{"$f":"RANK(X16,$X$7:$X$37,0)","v":10},"Diane Macdonald","F",{"$f":"VLOOKUP($O16,'Age Cat'!F:G,2,FALSE)","v":"V40"},{"$f":"IFERROR(VLOOKUP($O16,'2017 Road Table'!$B$3:$T$100,15,FALSE),\"\")","v":""},{"$f":"IFERROR(VLOOKUP($O16,'2017 Road Table'!$B$3:$T$100,16,FALSE),\"\")","v":""},{"$f":"IFERROR(VLOOKUP($O16,'2017 fell Table'!$B$3:$T$101,15,FALSE),\"\")","v":21},{"$f":"IFERROR(VLOOKUP(O16,'2017 fell Table'!$B$3:$T$101,16,FALSE),\"\")","v":""},{"$f":"IFERROR(VLOOKUP(O16,'2017 xc Table'!$B$3:$T$100,13,FALSE),\"\")","v":""},{"$f":"IFERROR(VLOOKUP(O16,'2017 extreme Table'!$B$3:$T$114,11,FALSE),\"\")","v":25},46]
[null,{"$f":"RANK(L17,$L$7:$L$47,0)","v":9},"Tony Booth","M",{"$f":"VLOOKUP($C17,'Age Cat'!F:G,2,FALSE)","v":"V40"},{"$f":"IFERROR(VLOOKUP($C17,'2017 Road Table'!$B$3:$T$100,15,FALSE),\"\")","v":24},{"$f":"IFERROR(VLOOKUP($C17,'2017 Road Table'!$B$3:$T$100,16,FALSE),\"\")","v":24},{"$f":"IFERROR(VLOOKUP($C17,'2017 fell Table'!$B$3:$T$101,15,FALSE),\"\")","v":""},{"$f":"IFERROR(VLOOKUP(C17,'2017 fell Table'!$B$3:$T$101,16,FALSE),\"\")","v":""},{"$f":"IFERROR(VLOOKUP(C17,'2017 xc Table'!$B$3:$T$100,13,FALSE),\"\")","v":""},{"$f":"IFERROR(VLOOKUP(C17,'2017 extreme Table'!$B$3:$T$114,11,FALSE),\"\")","v":""},48,null,{"$f":"RANK(X17,$X$7:$X$37,0)","v":10},"Donna Chester","F",{"$f":"VLOOKUP($O17,'Age Cat'!F:G,2,FALSE)","v":"V30"},{"$f":"IFERROR(VLOOKUP($O17,'2017 Road Table'!$B$3:$T$100,15,FALSE),\"\")","v":23},{"$f":"IFERROR(VLOOKUP($O17,'2017 Road Table'!$B$3:$T$100,16,FALSE),\"\")","v":""},{"$f":"IFERROR(VLOOKUP($O17,'2017 fell Table'!$B$3:$T$101,15,FALSE),\"\")","v":""},{"$f":"IFERROR(VLOOKUP(O17,'2017 fell Table'!$B$3:$T$101,16,FALSE),\"\")","v":""},{"$f":"IFERROR(VLOOKUP(O17,'2017 xc Table'!$B$3:$T$100,13,FALSE),\"\")","v":""},{"$f":"IFERROR(VLOOKUP(O17,'2017 extreme Table'!$B$3:$T$114,11,FALSE),\"\")","v":23},46]
[null,{"$f":"RANK(L18,$L$7:$L$47,0)","v":9},"Craig Cooper","M",{"$f":"VLOOKUP($C18,'Age Cat'!F:G,2,FALSE)","v":"V40"},{"$f":"IFERROR(VLOOKUP($C18,'2017 Road Table'!$B$3:$T$100,15,FALSE),\"\")","v":25},{"$f":"IFERROR(VLOOKUP($C18,'2017 Road Table'!$B$3:$T$100,16,FALSE),\"\")","v":23},{"$f":"IFERROR(VLOOKUP($C18,'2017 fell Table'!$B$3:$T$101,15,FALSE),\"\")","v":""},{"$f":"IFERROR(VLOOKUP(C18,'2017 fell Table'!$B$3:$T$101,16,FALSE),\"\")","v":""},{"$f":"IFERROR(VLOOKUP(C18,'2017 xc Table'!$B$3:$T$100,13,FALSE),\"\")","v":""},{"$f":"IFERROR(VLOOKUP(C18,'2017 extreme Table'!$B$3:$T$114,11,FALSE),\"\")","v":""},48,null,{"$f":"RANK(X18,$X$7:$X$37,0)","v":12},"Camille Askins","F",{"$f":"VLOOKUP($O18,'Age Cat'!F:G,2,FALSE)","v":"V40"},{"$f":"IFERROR(VLOOKUP($O18,'2017 Road Table'!$B$3:$T$100,15,FALSE),\"\")","v":22},{"$f":"IFERROR(VLOOKUP($O18,'2017 Road Table'!$B$3:$T$100,16,FALSE),\"\")","v":""},{"$f":"IFERROR(VLOOKUP($O18,'2017 fell Table'!$B$3:$T$101,15,FALSE),\"\")","v":""},{"$f":"IFERROR(VLOOKUP(O18,'2017 fell Table'!$B$3:$T$101,16,FALSE),\"\")","v":""},{"$f":"IFERROR(VLOOKUP(O18,'2017 xc Table'!$B$3:$T$100,13,FALSE),\"\")","v":21},{"$f":"IFERROR(VLOOKUP(O18,'2017 extreme Table'!$B$3:$T$114,11,FALSE),\"\")","v":""},43]
[null,{"$f":"RANK(L19,$L$7:$L$47,0)","v":13},"Dave Evans","M",{"$f":"VLOOKUP($C19,'Age Cat'!F:G,2,FALSE)","v":"V30"},{"$f":"IFERROR(VLOOKUP($C19,'2017 Road Table'!$B$3:$T$100,15,FALSE),\"\")","v":""},{"$f":"IFERROR(VLOOKUP($C19,'2017 Road Table'!$B$3:$T$100,16,FALSE),\"\")","v":""},{"$f":"IFERROR(VLOOKUP($C19,'2017 fell Table'!$B$3:$T$101,15,FALSE),\"\")","v":24},{"$f":"IFERROR(VLOOKUP(C19,'2017 fell Table'!$B$3:$T$101,16,FALSE),\"\")","v":23},{"$f":"IFERROR(VLOOKUP(C19,'2017 xc Table'!$B$3:$T$100,13,FALSE),\"\")","v":""},{"$f":"IFERROR(VLOOKUP(C19,'2017 extreme Table'!$B$3:$T$114,11,FALSE),\"\")","v":""},47,null,{"$f":"RANK(X19,$X$7:$X$37,0)","v":13},"Lorraine Bamfield","F",{"$f":"VLOOKUP($O19,'Age Cat'!F:G,2,FALSE)","v":"V40"},{"$f":"IFERROR(VLOOKUP($O19,'2017 Road Table'!$B$3:$T$100,15,FALSE),\"\")","v":21},{"$f":"IFERROR(VLOOKUP($O19,'2017 Road Table'!$B$3:$T$100,16,FALSE),\"\")","v":20},{"$f":"IFERROR(VLOOKUP($O19,'2017 fell Table'!$B$3:$T$101,15,FALSE),\"\")","v":""},{"$f":"IFERROR(VLOOKUP(O19,'2017 fell Table'!$B$3:$T$101,16,FALSE),\"\")","v":""},{"$f":"IFERROR(VLOOKUP(O19,'2017 xc Table'!$B$3:$T$100,13,FALSE),\"\")","v":""},{"$f":"IFERROR(VLOOKUP(O19,'2017 extreme Table'!$B$3:$T$114,11,FALSE),\"\")","v":""},41]
[null,{"$f":"RANK(L20,$L$7:$L$47,0)","v":14},"Alfie Walker","M",{"$f":"VLOOKUP($C20,'Age Cat'!F:G,2,FALSE)","v":"V40"},{"$f":"IFERROR(VLOOKUP($C20,'2017 Road Table'!$B$3:$T$100,15,FALSE),\"\")","v":""},{"$f":"IFERROR(VLOOKUP($C20,'2017 Road Table'!$B$3:$T$100,16,FALSE),\"\")","v":""},{"$f":"IFERROR(VLOOKUP($C20,'2017 fell Table'!$B$3:$T$101,15,FALSE),\"\")","v":23},{"$f":"IFERROR(VLOOKUP(C20,'2017 fell Table'!$B$3:$T$101,16,FALSE),\"\")","v":22},{"$f":"IFERROR(VLOOKUP(C20,'2017 xc Table'!$B$3:$T$100,13,FALSE),\"\")","v":""},{"$f":"IFERROR(VLOOKUP(C20,'2017 extreme Table'!$B$3:$T$114,11,FALSE),\"\")","v":""},45,null,{"$f":"RANK(X20,$X$7:$X$37,0)","v":14},"Lorna Hubbard","F",{"$f":"VLOOKUP($O20,'Age Cat'!F:G,2,FALSE)","v":"V30"},{"$f":"IFERROR(VLOOKUP($O20,'2017 Road Table'!$B$3:$T$100,15,FALSE),\"\")","v":""},{"$f":"IFERROR(VLOOKUP($O20,'2017 Road Table'!$B$3:$T$100,16,FALSE),\"\")","v":""},{"$f":"IFERROR(VLOOKUP($O20,'2017 fell Table'!$B$3:$T$101,15,FALSE),\"\")","v":25},{"$f":"IFERROR(VLOOKUP(O20,'2017 fell Table'!$B$3:$T$101,16,FALSE),\"\")","v":""},{"$f":"IFERROR(VLOOKUP(O20,'2017 xc Table'!$B$3:$T$100,13,FALSE),\"\")","v":""},{"$f":"IFERROR(VLOOKUP(O20,'2017 extreme Table'!$B$3:$T$114,11,FALSE),\"\")","v":""},{"$f":"SUM(R20:U20)+MAX(V20:W20)","v":25}]
[null,{"$f":"RANK(L21,$L$7:$L$47,0)","v":15},"Simon Wheeler","M",{"$f":"VLOOKUP($C21,'Age Cat'!F:G,2,FALSE)","v":"V40"},{"$f":"IFERROR(VLOOKUP($C21,'2017 Road Table'!$B$3:$T$100,15,FALSE),\"\")","v":""},{"$f":"IFERROR(VLOOKUP($C21,'2017 Road Table'!$B$3:$T$100,16,FALSE),\"\")","v":""},{"$f":"IFERROR(VLOOKUP($C21,'2017 fell Table'!$B$3:$T$101,15,FALSE),\"\")","v":19},{"$f":"IFERROR(VLOOKUP(C21,'2017 fell Table'!$B$3:$T$101,16,FALSE),\"\")","v":""},{"$f":"IFERROR(VLOOKUP(C21,'2017 xc Table'!$B$3:$T$100,13,FALSE),\"\")","v":""},{"$f":"IFERROR(VLOOKUP(C21,'2017 extreme Table'!$B$3:$T$114,11,FALSE),\"\")","v":20},39,null,{"$f":"RANK(X21,$X$7:$X$37,0)","v":14},"Angela Paxton","F",{"$f":"VLOOKUP($O21,'Age Cat'!F:G,2,FALSE)","v":"V50"},{"$f":"IFERROR(VLOOKUP($O21,'2017 Road Table'!$B$3:$T$100,15,FALSE),\"\")","v":""},{"$f":"IFERROR(VLOOKUP($O21,'2017 Road Table'!$B$3:$T$100,16,FALSE),\"\")","v":""},{"$f":"IFERROR(VLOOKUP($O21,'2017 fell Table'!$B$3:$T$101,15,FALSE),\"\")","v":""},{"$f":"IFERROR(VLOOKUP(O21,'2017 fell Table'!$B$3:$T$101,16,FALSE),\"\")","v":""},{"$f":"IFERROR(VLOOKUP(O21,'2017 xc Table'!$B$3:$T$100,13,FALSE),\"\")","v":22},{"$f":"IFERROR(VLOOKUP(O21,'2017 extreme Table'!$B$3:$T$114,11,FALSE),\"\")","v":25},25]
[null,{"$f":"RANK(L22,$L$7:$L$47,0)","v":16},"Richard Hindle","M",{"$f":"VLOOKUP($C22,'Age Cat'!F:G,2,FALSE)","v":"V60"},{"$f":"IFERROR(VLOOKUP($C22,'2017 Road Table'!$B$3:$T$100,15,FALSE),\"\")","v":""},{"$f":"IFERROR(VLOOKUP($C22,'2017 Road Table'!$B$3:$T$100,16,FALSE),\"\")","v":""},{"$f":"IFERROR(VLOOKUP($C22,'2017 fell Table'!$B$3:$T$101,15,FALSE),\"\")","v":20},{"$f":"IFERROR(VLOOKUP(C22,'2017 fell Table'!$B$3:$T$101,16,FALSE),\"\")","v":17},{"$f":"IFERROR(VLOOKUP(C22,'2017 xc Table'!$B$3:$T$100,13,FALSE),\"\")","v":""},{"$f":"IFERROR(VLOOKUP(C22,'2017 extreme Table'!$B$3:$T$114,11,FALSE),\"\")","v":""},37,null,{"$f":"RANK(X22,$X$7:$X$37,0)","v":16},"Sharon Hudson","F",{"$f":"VLOOKUP($O22,'Age Cat'!F:G,2,FALSE)","v":"V40"},{"$f":"IFERROR(VLOOKUP($O22,'2017 Road Table'!$B$3:$T$100,15,FALSE),\"\")","v":""},{"$f":"IFERROR(VLOOKUP($O22,'2017 Road Table'!$B$3:$T$100,16,FALSE),\"\")","v":""},{"$f":"IFERROR(VLOOKUP($O22,'2017 fell Table'!$B$3:$T$101,15,FALSE),\"\")","v":""},{"$f":"IFERROR(VLOOKUP(O22,'2017 fell Table'!$B$3:$T$101,16,FALSE),\"\")","v":""},{"$f":"IFERROR(VLOOKUP(O22,'2017 xc Table'!$B$3:$T$100,13,FALSE),\"\")","v":""},{"$f":"IFERROR(VLOOKUP(O22,'2017 extreme Table'!$B$3:$T$114,11,FALSE),\"\")","v":24},24]
[null,{"$f":"RANK(L23,$L$7:$L$47,0)","v":17},"Christopher Loftus","M",{"$f":"VLOOKUP($C23,'Age Cat'!F:G,2,FALSE)","v":"V40"},{"$f":"IFERROR(VLOOKUP($C23,'2017 Road Table'!$B$3:$T$100,15,FALSE),\"\")","v":""},{"$f":"IFERROR(VLOOKUP($C23,'2017 Road Table'!$B$3:$T$100,16,FALSE),\"\")","v":""},{"$f":"IFERROR(VLOOKUP($C23,'2017 fell Table'!$B$3:$T$101,15,FALSE),\"\")","v":""},{"$f":"IFERROR(VLOOKUP(C23,'2017 fell Table'!$B$3:$T$101,16,FALSE),\"\")","v":""},{"$f":"IFERROR(VLOOKUP(C23,'2017 xc Table'!$B$3:$T$100,13,FALSE),\"\")","v":""},{"$f":"IFERROR(VLOOKUP(C23,'2017 extreme Table'!$B$3:$T$114,11,FALSE),\"\")","v":25},25,null,{"$f":"RANK(X23,$X$7:$X$37,0)","v":17},"Emma Dooks","F",{"$f":"VLOOKUP($O23,'Age Cat'!F:G,2,FALSE)","v":"V50"},{"$f":"IFERROR(VLOOKUP($O23,'2017 Road Table'!$B$3:$T$100,15,FALSE),\"\")","v":""},{"$f":"IFERROR(VLOOKUP($O23,'2017 Road Table'!$B$3:$T$100,16,FALSE),\"\")","v":""},{"$f":"IFERROR(VLOOKUP($O23,'2017 fell Table'!$B$3:$T$101,15,FALSE),\"\")","v":22},{"$f":"IFERROR(VLOOKUP(O23,'2017 fell Table'!$B$3:$T$101,16,FALSE),\"\")","v":""},{"$f":"IFERROR(VLOOKUP(O23,'2017 xc Table'!$B$3:$T$100,13,FALSE),\"\")","v":""},{"$f":"IFERROR(VLOOKUP(O23,'2017 extreme Table'!$B$3:$T$114,11,FALSE),\"\")","v":""},22]
[null,{"$f":"RANK(L24,$L$7:$L$47,0)","v":17},"Gary Chapman","M",{"$f":"VLOOKUP($C24,'Age Cat'!F:G,2,FALSE)","v":"V40"},{"$f":"IFERROR(VLOOKUP($C24,'2017 Road Table'!$B$3:$T$100,15,FALSE),\"\")","v":25},{"$f":"IFERROR(VLOOKUP($C24,'2017 Road Table'!$B$3:$T$100,16,FALSE),\"\")","v":""},{"$f":"IFERROR(VLOOKUP($C24,'2017 fell Table'!$B$3:$T$101,15,FALSE),\"\")","v":""},{"$f":"IFERROR(VLOOKUP(C24,'2017 fell Table'!$B$3:$T$101,16,FALSE),\"\")","v":""},{"$f":"IFERROR(VLOOKUP(C24,'2017 xc Table'!$B$3:$T$100,13,FALSE),\"\")","v":""},{"$f":"IFERROR(VLOOKUP(C24,'2017 extreme Table'!$B$3:$T$114,11,FALSE),\"\")","v":""},25,null,{"$f":"RANK(X24,$X$7:$X$37,0)","v":17},"Victoria Wadsworth ","F",{"$f":"VLOOKUP($O24,'Age Cat'!F:G,2,FALSE)","v":"V40"},{"$f":"IFERROR(VLOOKUP($O24,'2017 Road Table'!$B$3:$T$100,15,FALSE),\"\")","v":""},{"$f":"IFERROR(VLOOKUP($O24,'2017 Road Table'!$B$3:$T$100,16,FALSE),\"\")","v":""},{"$f":"IFERROR(VLOOKUP($O24,'2017 fell Table'!$B$3:$T$101,15,FALSE),\"\")","v":""},{"$f":"IFERROR(VLOOKUP(O24,'2017 fell Table'!$B$3:$T$101,16,FALSE),\"\")","v":""},{"$f":"IFERROR(VLOOKUP(O24,'2017 xc Table'!$B$3:$T$100,13,FALSE),\"\")","v":""},{"$f":"IFERROR(VLOOKUP(O24,'2017 extreme Table'!$B$3:$T$114,11,FALSE),\"\")","v":22},{"$f":"SUM(R24:U24)+MAX(V24:W24)","v":22}]
[null,{"$f":"RANK(L25,$L$7:$L$47,0)","v":19},"Sam Downey","M",null,{"$f":"IFERROR(VLOOKUP($C25,'2017 Road Table'!$B$3:$T$100,15,FALSE),\"\")","v":""},{"$f":"IFERROR(VLOOKUP($C25,'2017 Road Table'!$B$3:$T$100,16,FALSE),\"\")","v":""},{"$f":"IFERROR(VLOOKUP($C25,'2017 fell Table'!$B$3:$T$101,15,FALSE),\"\")","v":""},{"$f":"IFERROR(VLOOKUP(C25,'2017 fell Table'!$B$3:$T$101,16,FALSE),\"\")","v":""},{"$f":"IFERROR(VLOOKUP(C25,'2017 xc Table'!$B$3:$T$100,13,FALSE),\"\")","v":""},{"$f":"IFERROR(VLOOKUP(C25,'2017 extreme Table'!$B$3:$T$114,11,FALSE),\"\")","v":24},24,null,{"$f":"RANK(X25,$X$7:$X$37,0)","v":19},"Heather Crow","F",{"$f":"VLOOKUP($O25,'Age Cat'!F:G,2,FALSE)","v":"S"},{"$f":"IFERROR(VLOOKUP($O25,'2017 Road Table'!$B$3:$T$100,15,FALSE),\"\")","v":21},{"$f":"IFERROR(VLOOKUP($O25,'2017 Road Table'!$B$3:$T$100,16,FALSE),\"\")","v":""},{"$f":"IFERROR(VLOOKUP($O25,'2017 fell Table'!$B$3:$T$101,15,FALSE),\"\")","v":""},{"$f":"IFERROR(VLOOKUP(O25,'2017 fell Table'!$B$3:$T$101,16,FALSE),\"\")","v":""},{"$f":"IFERROR(VLOOKUP(O25,'2017 xc Table'!$B$3:$T$100,13,FALSE),\"\")","v":""},{"$f":"IFERROR(VLOOKUP(O25,'2017 extreme Table'!$B$3:$T$114,11,FALSE),\"\")","v":""},21]
[null,{"$f":"RANK(L26,$L$7:$L$47,0)","v":19},"Chris Tomes","M",{"$f":"VLOOKUP($C26,'Age Cat'!F:G,2,FALSE)","v":"V60"},{"$f":"IFERROR(VLOOKUP($C26,'2017 Road Table'!$B$3:$T$100,15,FALSE),\"\")","v":24},{"$f":"IFERROR(VLOOKUP($C26,'2017 Road Table'!$B$3:$T$100,16,FALSE),\"\")","v":""},{"$f":"IFERROR(VLOOKUP($C26,'2017 fell Table'!$B$3:$T$101,15,FALSE),\"\")","v":""},{"$f":"IFERROR(VLOOKUP(C26,'2017 fell Table'!$B$3:$T$101,16,FALSE),\"\")","v":""},{"$f":"IFERROR(VLOOKUP(C26,'2017 xc Table'!$B$3:$T$100,13,FALSE),\"\")","v":""},{"$f":"IFERROR(VLOOKUP(C26,'2017 extreme Table'!$B$3:$T$114,11,FALSE),\"\")","v":""},{"$f":"SUM(F26:I26)+MAX(J26:K26)","v":24},null,{"$f":"RANK(X26,$X$7:$X$37,0)","v":19},"Kayleigh Fish","F",{"$f":"VLOOKUP($O26,'Age Cat'!F:G,2,FALSE)","v":"S"},{"$f":"IFERROR(VLOOKUP($O26,'2017 Road Table'!$B$3:$T$100,15,FALSE),\"\")","v":21},{"$f":"IFERROR(VLOOKUP($O26,'2017 Road Table'!$B$3:$T$100,16,FALSE),\"\")","v":""},{"$f":"IFERROR(VLOOKUP($O26,'2017 fell Table'!$B$3:$T$101,15,FALSE),\"\")","v":""},{"$f":"IFERROR(VLOOKUP(O26,'2017 fell Table'!$B$3:$T$101,16,FALSE),\"\")","v":""},{"$f":"IFERROR(VLOOKUP(O26,'2017 xc Table'!$B$3:$T$100,13,FALSE),\"\")","v":""},{"$f":"IFERROR(VLOOKUP(O26,'2017 extreme Table'!$B$3:$T$114,11,FALSE),\"\")","v":""},21]
[null,{"$f":"RANK(L27,$L$7:$L$47,0)","v":21},"Shaun Wilkinson","M",{"$f":"VLOOKUP($C27,'Age Cat'!F:G,2,FALSE)","v":"V50"},{"$f":"IFERROR(VLOOKUP($C27,'2017 Road Table'!$B$3:$T$100,15,FALSE),\"\")","v":""},{"$f":"IFERROR(VLOOKUP($C27,'2017 Road Table'!$B$3:$T$100,16,FALSE),\"\")","v":""},{"$f":"IFERROR(VLOOKUP($C27,'2017 fell Table'!$B$3:$T$101,15,FALSE),\"\")","v":""},{"$f":"IFERROR(VLOOKUP(C27,'2017 fell Table'!$B$3:$T$101,16,FALSE),\"\")","v":""},{"$f":"IFERROR(VLOOKUP(C27,'2017 xc Table'!$B$3:$T$100,13,FALSE),\"\")","v":""},{"$f":"IFERROR(VLOOKUP(C27,'2017 extreme Table'!$B$3:$T$114,11,FALSE),\"\")","v":23},23,null,{"$f":"RANK(X27,$X$7:$X$37,0)","v":21},"Samantha Knowles","F",{"$f":"VLOOKUP($O27,'Age Cat'!F:G,2,FALSE)","v":"V40"},{"$f":"IFERROR(VLOOKUP($O27,'2017 Road Table'!$B$3:$T$100,15,FALSE),\"\")","v":20},{"$f":"IFERROR(VLOOKUP($O27,'2017 Road Table'!$B$3:$T$100,16,FALSE),\"\")","v":""},{"$f":"IFERROR(VLOOKUP($O27,'2017 fell Table'!$B$3:$T$101,15,FALSE),\"\")","v":""},{"$f":"IFERROR(VLOOKUP(O27,'2017 fell Table'!$B$3:$T$101,16,FALSE),\"\")","v":""},{"$f":"IFERROR(VLOOKUP(O27,'2017 xc Table'!$B$3:$T$100,13,FALSE),\"\")","v":""},{"$f":"IFERROR(VLOOKUP(O27,'2017 extreme Table'!$B$3:$T$114,11,FALSE),\"\")","v":""},20]
[null,{"$f":"RANK(L28,$L$7:$L$47,0)","v":21},"Dick Ballantine","M",{"$f":"VLOOKUP($C28,'Age Cat'!F:G,2,FALSE)","v":"V50"},{"$f":"IFERROR(VLOOKUP($C28,'2017 Road Table'!$B$3:$T$100,15,FALSE),\"\")","v":""},{"$f":"IFERROR(VLOOKUP($C28,'2017 Road Table'!$B$3:$T$100,16,FALSE),\"\")","v":""},{"$f":"IFERROR(VLOOKUP($C28,'2017 fell Table'!$B$3:$T$101,15,FALSE),\"\")","v":""},{"$f":"IFERROR(VLOOKUP(C28,'2017 fell Table'!$B$3:$T$101,16,FALSE),\"\")","v":""},{"$f":"IFERROR(VLOOKUP(C28,'2017 xc Table'!$B$3:$T$100,13,FALSE),\"\")","v":""},{"$f":"IFERROR(VLOOKUP(C28,'2017 extreme Table'!$B$3:$T$114,11,FALSE),\"\")","v":23},23,null,{"$f":"RANK(X28,$X$7:$X$37,0)","v":22},"Sarah Meikle","F",{"$f":"VLOOKUP($O28,'Age Cat'!F:G,2,FALSE)","v":"V40"},{"$f":"IFERROR(VLOOKUP($O28,'2017 Road Table'!$B$3:$T$100,15,FALSE),\"\")","v":19},{"$f":"IFERROR(VLOOKUP($O28,'2017 Road Table'!$B$3:$T$100,16,FALSE),\"\")","v":""},{"$f":"IFERROR(VLOOKUP($O28,'2017 fell Table'!$B$3:$T$101,15,FALSE),\"\")","v":""},{"$f":"IFERROR(VLOOKUP(O28,'2017 fell Table'!$B$3:$T$101,16,FALSE),\"\")","v":""},{"$f":"IFERROR(VLOOKUP(O28,'2017 xc Table'!$B$3:$T$100,13,FALSE),\"\")","v":""},{"$f":"IFERROR(VLOOKUP(O28,'2017 extreme Table'!$B$3:$T$114,11,FALSE),\"\")","v":""},{"$f":"SUM(R28:U28)+MAX(V28:W28)","v":19}]
[null,{"$f":"RANK(L29,$L$7:$L$47,0)","v":21},"Paul Wilson","M",{"$f":"VLOOKUP($C29,'Age Cat'!F:G,2,FALSE)","v":"V40"},{"$f":"IFERROR(VLOOKUP($C29,'2017 Road Table'!$B$3:$T$100,15,FALSE),\"\")","v":23},{"$f":"IFERROR(VLOOKUP($C29,'2017 Road Table'!$B$3:$T$100,16,FALSE),\"\")","v":""},{"$f":"IFERROR(VLOOKUP($C29,'2017 fell Table'!$B$3:$T$101,15,FALSE),\"\")","v":""},{"$f":"IFERROR(VLOOKUP(C29,'2017 fell Table'!$B$3:$T$101,16,FALSE),\"\")","v":""},{"$f":"IFERROR(VLOOKUP(C29,'2017 xc Table'!$B$3:$T$100,13,FALSE),\"\")","v":""},{"$f":"IFERROR(VLOOKUP(C29,'2017 extreme Table'!$B$3:$T$114,11,FALSE),\"\")","v":""},23,null,{"$f":"RANK(X29,$X$7:$X$37,0)","v":23},"Luisa Lauren","F",{"$f":"VLOOKUP($O29,'Age Cat'!F:G,2,FALSE)","v":"V50"},{"$f":"IFERROR(VLOOKUP($O29,'2017 Road Table'!$B$3:$T$100,15,FALSE),\"\")","v":17},{"$f":"IFERROR(VLOOKUP($O29,'2017 Road Table'!$B$3:$T$100,16,FALSE),\"\")","v":""},{"$f":"IFERROR(VLOOKUP($O29,'2017 fell Table'!$B$3:$T$101,15,FALSE),\"\")","v":""},{"$f":"IFERROR(VLOOKUP(O29,'2017 fell Table'!$B$3:$T$101,16,FALSE),\"\")","v":""},{"$f":"IFERROR(VLOOKUP(O29,'2017 xc Table'!$B$3:$T$100,13,FALSE),\"\")","v":""},{"$f":"IFERROR(VLOOKUP(O29,'2017 extreme Table'!$B$3:$T$114,11,FALSE),\"\")","v":""},17]
[null,{"$f":"RANK(L30,$L$7:$L$47,0)","v":24},"Simon Smallwood","M",{"$f":"VLOOKUP($C30,'Age Cat'!F:G,2,FALSE)","v":"V50"},{"$f":"IFERROR(VLOOKUP($C30,'2017 Road Table'!$B$3:$T$100,15,FALSE),\"\")","v":22},{"$f":"IFERROR(VLOOKUP($C30,'2017 Road Table'!$B$3:$T$100,16,FALSE),\"\")","v":""},{"$f":"IFERROR(VLOOKUP($C30,'2017 fell Table'!$B$3:$T$101,15,FALSE),\"\")","v":""},{"$f":"IFERROR(VLOOKUP(C30,'2017 fell Table'!$B$3:$T$101,16,FALSE),\"\")","v":""},{"$f":"IFERROR(VLOOKUP(C30,'2017 xc Table'!$B$3:$T$100,13,FALSE),\"\")","v":""},{"$f":"IFERROR(VLOOKUP(C30,'2017 extreme Table'!$B$3:$T$114,11,FALSE),\"\")","v":""},22,null,{"$f":"RANK(X30,$X$7:$X$37,0)","v":24},"Paula Williams","F",{"$f":"VLOOKUP($O30,'Age Cat'!F:G,2,FALSE)","v":"V40"},{"$f":"IFERROR(VLOOKUP($O30,'2017 Road Table'!$B$3:$T$100,15,FALSE),\"\")","v":16},{"$f":"IFERROR(VLOOKUP($O30,'2017 Road Table'!$B$3:$T$100,16,FALSE),\"\")","v":""},{"$f":"IFERROR(VLOOKUP($O30,'2017 fell Table'!$B$3:$T$101,15,FALSE),\"\")","v":""},{"$f":"IFERROR(VLOOKUP(O30,'2017 fell Table'!$B$3:$T$101,16,FALSE),\"\")","v":""},{"$f":"IFERROR(VLOOKUP(O30,'2017 xc Table'!$B$3:$T$100,13,FALSE),\"\")","v":""},{"$f":"IFERROR(VLOOKUP(O30,'2017 extreme Table'!$B$3:$T$114,11,FALSE),\"\")","v":""},16]
[null,{"$f":"RANK(L31,$L$7:$L$47,0)","v":24},"Ben Timbers","M",{"$f":"VLOOKUP($C31,'Age Cat'!F:G,2,FALSE)","v":"V40"},{"$f":"IFERROR(VLOOKUP($C31,'2017 Road Table'!$B$3:$T$100,15,FALSE),\"\")","v":""},{"$f":"IFERROR(VLOOKUP($C31,'2017 Road Table'!$B$3:$T$100,16,FALSE),\"\")","v":""},{"$f":"IFERROR(VLOOKUP($C31,'2017 fell Table'!$B$3:$T$101,15,FALSE),\"\")","v":""},{"$f":"IFERROR(VLOOKUP(C31,'2017 fell Table'!$B$3:$T$101,16,FALSE),\"\")","v":""},{"$f":"IFERROR(VLOOKUP(C31,'2017 xc Table'!$B$3:$T$100,13,FALSE),\"\")","v":""},{"$f":"IFERROR(VLOOKUP(C31,'2017 extreme Table'!$B$3:$T$114,11,FALSE),\"\")","v":22},22,null,{"$f":"RANK(X31,$X$7:$X$37,0)","v":25},"Catherine Bellwood","F",{"$f":"VLOOKUP($O31,'Age Cat'!F:G,2,FALSE)","v":"V50"},{"$f":"IFERROR(VLOOKUP($O31,'2017 Road Table'!$B$3:$T$100,15,FALSE),\"\")","v":15},{"$f":"IFERROR(VLOOKUP($O31,'2017 Road Table'!$B$3:$T$100,16,FALSE),\"\")","v":""},{"$f":"IFERROR(VLOOKUP($O31,'2017 fell Table'!$B$3:$T$101,15,FALSE),\"\")","v":""},{"$f":"IFERROR(VLOOKUP(O31,'2017 fell Table'!$B$3:$T$101,16,FALSE),\"\")","v":""},{"$f":"IFERROR(VLOOKUP(O31,'2017 xc Table'!$B$3:$T$100,13,FALSE),\"\")","v":""},{"$f":"IFERROR(VLOOKUP(O31,'2017 extreme Table'!$B$3:$T$114,11,FALSE),\"\")","v":""},15]
[null,{"$f":"RANK(L32,$L$7:$L$47,0)","v":24},"Joe Atherton","M",{"$f":"VLOOKUP($C32,'Age Cat'!F:G,2,FALSE)","v":"V30"},{"$f":"IFERROR(VLOOKUP($C32,'2017 Road Table'!$B$3:$T$100,15,FALSE),\"\")","v":22},{"$f":"IFERROR(VLOOKUP($C32,'2017 Road Table'!$B$3:$T$100,16,FALSE),\"\")","v":""},{"$f":"IFERROR(VLOOKUP($C32,'2017 fell Table'!$B$3:$T$101,15,FALSE),\"\")","v":""},{"$f":"IFERROR(VLOOKUP(C32,'2017 fell Table'!$B$3:$T$101,16,FALSE),\"\")","v":""},{"$f":"IFERROR(VLOOKUP(C32,'2017 xc Table'!$B$3:$T$100,13,FALSE),\"\")","v":""},{"$f":"IFERROR(VLOOKUP(C32,'2017 extreme Table'!$B$3:$T$114,11,FALSE),\"\")","v":""},22,null,{"$f":"RANK(X32,$X$7:$X$37,0)","v":26},"Mary Hodgkiss","F",{"$f":"VLOOKUP($O32,'Age Cat'!F:G,2,FALSE)","v":"V60"},{"$f":"IFERROR(VLOOKUP($O32,'2017 Road Table'!$B$3:$T$100,15,FALSE),\"\")","v":14},{"$f":"IFERROR(VLOOKUP($O32,'2017 Road Table'!$B$3:$T$100,16,FALSE),\"\")","v":""},{"$f":"IFERROR(VLOOKUP($O32,'2017 fell Table'!$B$3:$T$101,15,FALSE),\"\")","v":""},{"$f":"IFERROR(VLOOKUP(O32,'2017 fell Table'!$B$3:$T$101,16,FALSE),\"\")","v":""},{"$f":"IFERROR(VLOOKUP(O32,'2017 xc Table'!$B$3:$T$100,13,FALSE),\"\")","v":""},{"$f":"IFERROR(VLOOKUP(O32,'2017 extreme Table'!$B$3:$T$114,11,FALSE),\"\")","v":""},14]
[null,{"$f":"RANK(L33,$L$7:$L$47,0)","v":24},"Simon Bellwood ","M",{"$f":"VLOOKUP($C33,'Age Cat'!F:G,2,FALSE)","v":"V50"},{"$f":"IFERROR(VLOOKUP($C33,'2017 Road Table'!$B$3:$T$100,15,FALSE),\"\")","v":""},{"$f":"IFERROR(VLOOKUP($C33,'2017 Road Table'!$B$3:$T$100,16,FALSE),\"\")","v":""},{"$f":"IFERROR(VLOOKUP($C33,'2017 fell Table'!$B$3:$T$101,15,FALSE),\"\")","v":""},{"$f":"IFERROR(VLOOKUP(C33,'2017 fell Table'!$B$3:$T$101,16,FALSE),\"\")","v":""},{"$f":"IFERROR(VLOOKUP(C33,'2017 xc Table'!$B$3:$T$100,13,FALSE),\"\")","v":""},{"$f":"IFERROR(VLOOKUP(C33,'2017 extreme Table'!$B$3:$T$114,11,FALSE),\"\")","v":22},22,null,{"$f":"RANK(X33,$X$7:$X$37,0)","v":27},"Andrea Stead","F",null,{"$f":"IFERROR(VLOOKUP($O33,'2017 Road Table'!$B$3:$T$100,15,FALSE),\"\")","v":13},{"$f":"IFERROR(VLOOKUP($O33,'2017 Road Table'!$B$3:$T$100,16,FALSE),\"\")","v":""},{"$f":"IFERROR(VLOOKUP($O33,'2017 fell Table'!$B$3:$T$101,15,FALSE),\"\")","v":""},{"$f":"IFERROR(VLOOKUP(O33,'2017 fell Table'!$B$3:$T$101,16,FALSE),\"\")","v":""},{"$f":"IFERROR(VLOOKUP(O33,'2017 xc Table'!$B$3:$T$100,13,FALSE),\"\")","v":""},{"$f":"IFERROR(VLOOKUP(O33,'2017 extreme Table'!$B$3:$T$114,11,FALSE),\"\")","v":""},13]
[null,{"$f":"RANK(L34,$L$7:$L$47,0)","v":28},"Rick Harwood","M",null,{"$f":"IFERROR(VLOOKUP($C34,'2017 Road Table'!$B$3:$T$100,15,FALSE),\"\")","v":""},{"$f":"IFERROR(VLOOKUP($C34,'2017 Road Table'!$B$3:$T$100,16,FALSE),\"\")","v":""},{"$f":"IFERROR(VLOOKUP($C34,'2017 fell Table'!$B$3:$T$101,15,FALSE),\"\")","v":""},{"$f":"IFERROR(VLOOKUP(C34,'2017 fell Table'!$B$3:$T$101,16,FALSE),\"\")","v":""},{"$f":"IFERROR(VLOOKUP(C34,'2017 xc Table'!$B$3:$T$100,13,FALSE),\"\")","v":""},{"$f":"IFERROR(VLOOKUP(C34,'2017 extreme Table'!$B$3:$T$114,11,FALSE),\"\")","v":21},{"$f":"SUM(F34:I34)+MAX(J34:K34)","v":21}]
[null,{"$f":"RANK(L35,$L$7:$L$47,0)","v":28},"Anand Raval","M",{"$f":"VLOOKUP($C35,'Age Cat'!F:G,2,FALSE)","v":"V30"},{"$f":"IFERROR(VLOOKUP($C35,'2017 Road Table'!$B$3:$T$100,15,FALSE),\"\")","v":21},{"$f":"IFERROR(VLOOKUP($C35,'2017 Road Table'!$B$3:$T$100,16,FALSE),\"\")","v":""},{"$f":"IFERROR(VLOOKUP($C35,'2017 fell Table'!$B$3:$T$101,15,FALSE),\"\")","v":""},{"$f":"IFERROR(VLOOKUP(C35,'2017 fell Table'!$B$3:$T$101,16,FALSE),\"\")","v":""},{"$f":"IFERROR(VLOOKUP(C35,'2017 xc Table'!$B$3:$T$100,13,FALSE),\"\")","v":""},{"$f":"IFERROR(VLOOKUP(C35,'2017 extreme Table'!$B$3:$T$114,11,FALSE),\"\")","v":""},{"$f":"SUM(F35:I35)+MAX(J35:K35)","v":21}]
[null,{"$f":"RANK(L36,$L$7:$L$47,0)","v":28},"Russell Fairhurst","M",{"$f":"VLOOKUP($C36,'Age Cat'!F:G,2,FALSE)","v":"V50"},{"$f":"IFERROR(VLOOKUP($C36,'2017 Road Table'!$B$3:$T$100,15,FALSE),\"\")","v":""},{"$f":"IFERROR(VLOOKUP($C36,'2017 Road Table'!$B$3:$T$100,16,FALSE),\"\")","v":""},{"$f":"IFERROR(VLOOKUP($C36,'2017 fell Table'!$B$3:$T$101,15,FALSE),\"\")","v":""},{"$f":"IFERROR(VLOOKUP(C36,'2017 fell Table'!$B$3:$T$101,16,FALSE),\"\")","v":""},{"$f":"IFERROR(VLOOKUP(C36,'2017 xc Table'!$B$3:$T$100,13,FALSE),\"\")","v":""},{"$f":"IFERROR(VLOOKUP(C36,'2017 extreme Table'!$B$3:$T$114,11,FALSE),\"\")","v":21},21]
[null,{"$f":"RANK(L37,$L$7:$L$47,0)","v":31},"Simon Chester","M",{"$f":"VLOOKUP($C37,'Age Cat'!F:G,2,FALSE)","v":"V40"},{"$f":"IFERROR(VLOOKUP($C37,'2017 Road Table'!$B$3:$T$100,15,FALSE),\"\")","v":20},{"$f":"IFERROR(VLOOKUP($C37,'2017 Road Table'!$B$3:$T$100,16,FALSE),\"\")","v":""},{"$f":"IFERROR(VLOOKUP($C37,'2017 fell Table'!$B$3:$T$101,15,FALSE),\"\")","v":""},{"$f":"IFERROR(VLOOKUP(C37,'2017 fell Table'!$B$3:$T$101,16,FALSE),\"\")","v":""},{"$f":"IFERROR(VLOOKUP(C37,'2017 xc Table'!$B$3:$T$100,13,FALSE),\"\")","v":""},{"$f":"IFERROR(VLOOKUP(C37,'2017 extreme Table'!$B$3:$T$114,11,FALSE),\"\")","v":""},20]
[null,{"$f":"RANK(L38,$L$7:$L$47,0)","v":32},"Steve Carter ","M",{"$f":"VLOOKUP($C38,'Age Cat'!F:G,2,FALSE)","v":"V60"},{"$f":"IFERROR(VLOOKUP($C38,'2017 Road Table'!$B$3:$T$100,15,FALSE),\"\")","v":""},{"$f":"IFERROR(VLOOKUP($C38,'2017 Road Table'!$B$3:$T$100,16,FALSE),\"\")","v":""},{"$f":"IFERROR(VLOOKUP($C38,'2017 fell Table'!$B$3:$T$101,15,FALSE),\"\")","v":""},{"$f":"IFERROR(VLOOKUP(C38,'2017 fell Table'!$B$3:$T$101,16,FALSE),\"\")","v":""},{"$f":"IFERROR(VLOOKUP(C38,'2017 xc Table'!$B$3:$T$100,13,FALSE),\"\")","v":""},{"$f":"IFERROR(VLOOKUP(C38,'2017 extreme Table'!$B$3:$T$114,11,FALSE),\"\")","v":19},19]
[null,{"$f":"RANK(L39,$L$7:$L$47,0)","v":33},"Russell Aydon-Butler","M",null,{"$f":"IFERROR(VLOOKUP($C39,'2017 Road Table'!$B$3:$T$100,15,FALSE),\"\")","v":""},{"$f":"IFERROR(VLOOKUP($C39,'2017 Road Table'!$B$3:$T$100,16,FALSE),\"\")","v":""},{"$f":"IFERROR(VLOOKUP($C39,'2017 fell Table'!$B$3:$T$101,15,FALSE),\"\")","v":""},{"$f":"IFERROR(VLOOKUP(C39,'2017 fell Table'!$B$3:$T$101,16,FALSE),\"\")","v":""},{"$f":"IFERROR(VLOOKUP(C39,'2017 xc Table'!$B$3:$T$100,13,FALSE),\"\")","v":""},{"$f":"IFERROR(VLOOKUP(C39,'2017 extreme Table'!$B$3:$T$114,11,FALSE),\"\")","v":18},18]
[null,{"$f":"RANK(L40,$L$7:$L$47,0)","v":33},"Ian Rodgers","M",null,{"$f":"IFERROR(VLOOKUP($C40,'2017 Road Table'!$B$3:$T$100,15,FALSE),\"\")","v":""},{"$f":"IFERROR(VLOOKUP($C40,'2017 Road Table'!$B$3:$T$100,16,FALSE),\"\")","v":""},{"$f":"IFERROR(VLOOKUP($C40,'2017 fell Table'!$B$3:$T$101,15,FALSE),\"\")","v":""},{"$f":"IFERROR(VLOOKUP(C40,'2017 fell Table'!$B$3:$T$101,16,FALSE),\"\")","v":""},{"$f":"IFERROR(VLOOKUP(C40,'2017 xc Table'!$B$3:$T$100,13,FALSE),\"\")","v":""},{"$f":"IFERROR(VLOOKUP(C40,'2017 extreme Table'!$B$3:$T$114,11,FALSE),\"\")","v":18},18]
[null,{"$f":"RANK(L41,$L$7:$L$47,0)","v":35},"David Copping","M",{"$f":"VLOOKUP($C41,'Age Cat'!F:G,2,FALSE)","v":"V50"},{"$f":"IFERROR(VLOOKUP($C41,'2017 Road Table'!$B$3:$T$100,15,FALSE),\"\")","v":""},{"$f":"IFERROR(VLOOKUP($C41,'2017 Road Table'!$B$3:$T$100,16,FALSE),\"\")","v":""},{"$f":"IFERROR(VLOOKUP($C41,'2017 fell Table'!$B$3:$T$101,15,FALSE),\"\")","v":""},{"$f":"IFERROR(VLOOKUP(C41,'2017 fell Table'!$B$3:$T$101,16,FALSE),\"\")","v":""},{"$f":"IFERROR(VLOOKUP(C41,'2017 xc Table'!$B$3:$T$100,13,FALSE),\"\")","v":""},{"$f":"IFERROR(VLOOKUP(C41,'2017 extreme Table'!$B$3:$T$114,11,FALSE),\"\")","v":17},17]
[null,{"$f":"RANK(L42,$L$7:$L$47,0)","v":35},"Paul Sessford","M",{"$f":"VLOOKUP($C42,'Age Cat'!F:G,2,FALSE)","v":"V50"},{"$f":"IFERROR(VLOOKUP($C42,'2017 Road Table'!$B$3:$T$100,15,FALSE),\"\")","v":""},{"$f":"IFERROR(VLOOKUP($C42,'2017 Road Table'!$B$3:$T$100,16,FALSE),\"\")","v":""},{"$f":"IFERROR(VLOOKUP($C42,'2017 fell Table'!$B$3:$T$101,15,FALSE),\"\")","v":17},{"$f":"IFERROR(VLOOKUP(C42,'2017 fell Table'!$B$3:$T$101,16,FALSE),\"\")","v":""},{"$f":"IFERROR(VLOOKUP(C42,'2017 xc Table'!$B$3:$T$100,13,FALSE),\"\")","v":""},{"$f":"IFERROR(VLOOKUP(C42,'2017 extreme Table'!$B$3:$T$114,11,FALSE),\"\")","v":""},17]
[null,{"$f":"RANK(L43,$L$7:$L$47,0)","v":37},"Andrew Travis","M",{"$f":"VLOOKUP($C43,'Age Cat'!F:G,2,FALSE)","v":"V40"},{"$f":"IFERROR(VLOOKUP($C43,'2017 Road Table'!$B$3:$T$100,15,FALSE),\"\")","v":""},{"$f":"IFERROR(VLOOKUP($C43,'2017 Road Table'!$B$3:$T$100,16,FALSE),\"\")","v":""},{"$f":"IFERROR(VLOOKUP($C43,'2017 fell Table'!$B$3:$T$101,15,FALSE),\"\")","v":""},{"$f":"IFERROR(VLOOKUP(C43,'2017 fell Table'!$B$3:$T$101,16,FALSE),\"\")","v":""},{"$f":"IFERROR(VLOOKUP(C43,'2017 xc Table'!$B$3:$T$100,13,FALSE),\"\")","v":""},{"$f":"IFERROR(VLOOKUP(C43,'2017 extreme Table'!$B$3:$T$114,11,FALSE),\"\")","v":16},16]
[null,{"$f":"RANK(L44,$L$7:$L$47,0)","v":38},"Dan Timbers","M",null,{"$f":"IFERROR(VLOOKUP($C44,'2017 Road Table'!$B$3:$T$100,15,FALSE),\"\")","v":""},{"$f":"IFERROR(VLOOKUP($C44,'2017 Road Table'!$B$3:$T$100,16,FALSE),\"\")","v":""},{"$f":"IFERROR(VLOOKUP($C44,'2017 fell Table'!$B$3:$T$101,15,FALSE),\"\")","v":""},{"$f":"IFERROR(VLOOKUP(C44,'2017 fell Table'!$B$3:$T$101,16,FALSE),\"\")","v":""},{"$f":"IFERROR(VLOOKUP(C44,'2017 xc Table'!$B$3:$T$100,13,FALSE),\"\")","v":""},{"$f":"IFERROR(VLOOKUP(C44,'2017 extreme Table'!$B$3:$T$114,11,FALSE),\"\")","v":13},13]
[null,{"$f":"RANK(L45,$L$7:$L$47,0)","v":39},"Peter Smith","M",{"$f":"VLOOKUP($C45,'Age Cat'!F:G,2,FALSE)","v":"V30"},{"$f":"IFERROR(VLOOKUP($C45,'2017 Road Table'!$B$3:$T$100,15,FALSE),\"\")","v":""},{"$f":"IFERROR(VLOOKUP($C45,'2017 Road Table'!$B$3:$T$100,16,FALSE),\"\")","v":""},{"$f":"IFERROR(VLOOKUP($C45,'2017 fell Table'!$B$3:$T$101,15,FALSE),\"\")","v":""},{"$f":"IFERROR(VLOOKUP(C45,'2017 fell Table'!$B$3:$T$101,16,FALSE),\"\")","v":""},{"$f":"IFERROR(VLOOKUP(C45,'2017 xc Table'!$B$3:$T$100,13,FALSE),\"\")","v":""},{"$f":"IFERROR(VLOOKUP(C45,'2017 extreme Table'!$B$3:$T$114,11,FALSE),\"\")","v":""},0]
[null,{"$f":"RANK(L46,$L$7:$L$47,0)","v":39},"Dave Copping","M",null,{"$f":"IFERROR(VLOOKUP($C46,'2017 Road Table'!$B$3:$T$100,15,FALSE),\"\")","v":""},{"$f":"IFERROR(VLOOKUP($C46,'2017 Road Table'!$B$3:$T$100,16,FALSE),\"\")","v":""},{"$f":"IFERROR(VLOOKUP($C46,'2017 fell Table'!$B$3:$T$101,15,FALSE),\"\")","v":""},{"$f":"IFERROR(VLOOKUP(C46,'2017 fell Table'!$B$3:$T$101,16,FALSE),\"\")","v":""},{"$f":"IFERROR(VLOOKUP(C46,'2017 xc Table'!$B$3:$T$100,13,FALSE),\"\")","v":""},{"$f":"IFERROR(VLOOKUP(C46,'2017 extreme Table'!$B$3:$T$114,11,FALSE),\"\")","v":""},0]
[null,{"$f":"RANK(L47,$L$7:$L$47,0)","v":39},"Alistair Gavins ","M",{"$f":"VLOOKUP($C47,'Age Cat'!F:G,2,FALSE)","v":"V50"},{"$f":"IFERROR(VLOOKUP($C47,'2017 Road Table'!$B$3:$T$100,15,FALSE),\"\")","v":""},{"$f":"IFERROR(VLOOKUP($C47,'2017 Road Table'!$B$3:$T$100,16,FALSE),\"\")","v":""},{"$f":"IFERROR(VLOOKUP($C47,'2017 fell Table'!$B$3:$T$101,15,FALSE),\"\")","v":""},{"$f":"IFERROR(VLOOKUP(C47,'2017 fell Table'!$B$3:$T$101,16,FALSE),\"\")","v":""},{"$f":"IFERROR(VLOOKUP(C47,'2017 xc Table'!$B$3:$T$100,13,FALSE),\"\")","v":""},{"$f":"IFERROR(VLOOKUP(C47,'2017 extreme Table'!$B$3:$T$114,11,FALSE),\"\")","v":""},0]

{"sheet":"2017 extreme Table","index":2,"n_rows":61,"n_cols":18,"rows_kept":61,"cut":false,"hidden":false,"merged":[[0,0,1,1],[2,0,3,0],[2,1,3,1],[2,8,3,8],[2,9,3,9],[2,11,2,13],[42,11,42,13],[66,1,66,9],[42,0,43,0],[42,1,43,1],[42,8,43,8],[42,9,43,9],[55,3,55,7],[55,8,55,10],[2,10,3,10],[42,10,43,10]]}
["2017 - Extreme\n(Best 3 of 5 Races)"]
[null,null,null,{"$f":"VLOOKUP(D3,$A$57:$C$65,3,FALSE)","v":"Rombald Stride 23m"},{"$f":"VLOOKUP(E3,$A$57:$C$65,3,FALSE)","v":"3 Peaks 23.2m"},{"$f":"VLOOKUP(F3,$A$57:$C$65,3,FALSE)","v":"Ennerdale 22.9m"},{"$f":"VLOOKUP(G3,$A$57:$C$65,3,FALSE)","v":"Borrowdale 16.8m"},{"$f":"VLOOKUP(H3,$A$57:$C$65,3,FALSE)","v":"Full Tour of Pendle 16.8m"}]
["Pos","Name",null,1,2,3,4,5,"Total","Scoring Total","# Races","Top 3 results"]
[null,null,null,{"$f":"VLOOKUP(D3,$A$57:$C$65,2,FALSE)","v":"2017-02-04"},{"$f":"VLOOKUP(E3,$A$57:$C$65,2,FALSE)","v":"2017-04-29"},{"$f":"VLOOKUP(F3,$A$57:$C$65,2,FALSE)","v":"2017-06-10"},{"$f":"VLOOKUP(G3,$A$57:$C$65,2,FALSE)","v":"2017-08-05"},{"$f":"VLOOKUP(H3,$A$57:$C$65,2,FALSE)","v":"2017-11-18"},null,null,null,{"$f":"D3","v":1},{"$f":"E3","v":2},{"$f":"F3","v":3}]
[{"$f":"RANK(J5,$J$5:$J$39,0)","v":1},"Dick Ballantine",{"$f":"VLOOKUP(B5,'Age Cat'!F:G,2,FALSE)","v":"V50"},{"$f":"IFERROR(VLOOKUP($B5,'2017 extreme results'!$B$3:$D$14,3,FALSE),\"\")","v":23},{"$f":"IFERROR(VLOOKUP($B5,'2017 extreme results'!$B$22:$D$31,3,FALSE),\"\")","v":""},{"$f":"IFERROR(VLOOKUP($B5,'2017 extreme results'!$B$34:$D$49,3,FALSE),\"\")","v":12},{"$f":"IFERROR(VLOOKUP($B5,'2017 extreme results'!$B$53:$D$64,3,FALSE),\"\")","v":""},{"$f":"IFERROR(VLOOKUP($B5,'2017 extreme results'!$B$68:$D$79,3,FALSE),\"\")","v":""},{"$f":"IF(SUM(D5:H5)=0,\"\",SUM(D5:H5))","v":35},{"$f":"SUM(L5:N5)","v":35},{"$f":"IF(COUNT(D5:H5)=0,\"\",COUNT(D5:H5))","v":2},{"$f":"IFERROR(LARGE($D5:$H$5,D3),\"\")","v":23},{"$f":"IFERROR(LARGE($D5:$H$5,E3),\"\")","v":12},{"$f":"IFERROR(LARGE($D5:$H$5,F3),\"\")","v":""},{"$f":"COUNT(L5:N5)","v":2}]
[{"$f":"RANK(J6,$J$5:$J$39,0)","v":2},"Simon Wheeler",{"$f":"VLOOKUP(B6,'Age Cat'!F:G,2,FALSE)","v":"V40"},{"$f":"IFERROR(VLOOKUP($B6,'2017 extreme results'!$B$3:$D$14,3,FALSE),\"\")","v":20},{"$f":"IFERROR(VLOOKUP($B6,'2017 extreme results'!$B$22:$D$31,3,FALSE),\"\")","v":""},{"$f":"IFERROR(VLOOKUP($B6,'2017 extreme results'!$B$34:$D$49,3,FALSE),\"\")","v":10},{"$f":"IFERROR(VLOOKUP($B6,'2017 extreme results'!$B$53:$D$64,3,FALSE),\"\")","v":""},{"$f":"IFERROR(VLOOKUP($B6,'2017 extreme results'!$B$68:$D$79,3,FALSE),\"\")","v":""},{"$f":"IF(SUM(D6:H6)=0,\"\",SUM(D6:H6))","v":30},{"$f":"SUM(L6:N6)","v":30},{"$f":"IF(COUNT(D6:H6)=0,\"\",COUNT(D6:H6))","v":2},{"$f":"IFERROR(LARGE($D6:$H6,D$3),\"\")","v":20},{"$f":"IFERROR(LARGE($D6:$H6,E$3),\"\")","v":10},{"$f":"IFERROR(LARGE($D6:$H6,F$3),\"\")","v":""},{"$f":"COUNT(L6:N6)","v":2}]
[{"$f":"RANK(J7,$J$5:$J$39,0)","v":3},"John-Paul Hopkinson",{"$f":"VLOOKUP(B7,'Age Cat'!F:G,2,FALSE)","v":"V40"},{"$f":"IFERROR(VLOOKUP($B7,'2017 extreme results'!$B$3:$D$14,3,FALSE),\"\")","v":25},{"$f":"IFERROR(VLOOKUP($B7,'2017 extreme results'!$B$22:$D$31,3,FALSE),\"\")","v":""},{"$f":"IFERROR(VLOOKUP($B7,'2017 extreme results'!$B$34:$D$49,3,FALSE),\"\")","v":""},{"$f":"IFERROR(VLOOKUP($B7,'2017 extreme results'!$B$53:$D$64,3,FALSE),\"\")","v":""},{"$f":"IFERROR(VLOOKUP($B7,'2017 extreme results'!$B$68:$D$79,3,FALSE),\"\")","v":""},25,25,1,25,"","",1]
[{"$f":"RANK(J8,$J$5:$J$39,0)","v":3},"Christopher Loftus",{"$f":"VLOOKUP(B8,'Age Cat'!F:G,2,FALSE)","v":"V40"},{"$f":"IFERROR(VLOOKUP($B8,'2017 extreme results'!$B$3:$D$14,3,FALSE),\"\")","v":""},{"$f":"IFERROR(VLOOKUP($B8,'2017 extreme results'!$B$22:$D$31,3,FALSE),\"\")","v":25},{"$f":"IFERROR(VLOOKUP($B8,'2017 extreme results'!$B$34:$D$49,3,FALSE),\"\")","v":""},{"$f":"IFERROR(VLOOKUP($B8,'2017 extreme results'!$B$53:$D$64,3,FALSE),\"\")","v":""},{"$f":"IFERROR(VLOOKUP($B8,'2017 extreme results'!$B$68:$D$79,3,FALSE),\"\")","v":""},25,25,1,25,"","",1]
[{"$f":"RANK(J9,$J$5:$J$39,0)","v":5},"Sam Downey",null,{"$f":"IFERROR(VLOOKUP($B9,'2017 extreme results'!$B$3:$D$14,3,FALSE),\"\")","v":""},{"$f":"IFERROR(VLOOKUP($B9,'2017 extreme results'!$B$22:$D$31,3,FALSE),\"\")","v":24},{"$f":"IFERROR(VLOOKUP($B9,'2017 extreme results'!$B$34:$D$49,3,FALSE),\"\")","v":""},{"$f":"IFERROR(VLOOKUP($B9,'2017 extreme results'!$B$53:$D$64,3,FALSE),\"\")","v":""},{"$f":"IFERROR(VLOOKUP($B9,'2017 extreme results'!$B$68:$D$79,3,FALSE),\"\")","v":""},24,24,1,24,"","",1]
[{"$f":"RANK(J10,$J$5:$J$39,0)","v":6},"Shaun Wilkinson",{"$f":"VLOOKUP(B10,'Age Cat'!F:G,2,FALSE)","v":"V50"},{"$f":"IFERROR(VLOOKUP($B10,'2017 extreme results'!$B$3:$D$14,3,FALSE),\"\")","v":""},{"$f":"IFERROR(VLOOKUP($B10,'2017 extreme results'!$B$22:$D$31,3,FALSE),\"\")","v":23},{"$f":"IFERROR(VLOOKUP($B10,'2017 extreme results'!$B$34:$D$49,3,FALSE),\"\")","v":""},{"$f":"IFERROR(VLOOKUP($B10,'2017 extreme results'!$B$53:$D$64,3,FALSE),\"\")","v":""},{"$f":"IFERROR(VLOOKUP($B10,'2017 extreme results'!$B$68:$D$79,3,FALSE),\"\")","v":""},23,23,1,23,"","",1]
[{"$f":"RANK(J11,$J$5:$J$39,0)","v":7},"Ben Timbers",{"$f":"VLOOKUP(B11,'Age Cat'!F:G,2,FALSE)","v":"V40"},{"$f":"IFERROR(VLOOKUP($B11,'2017 extreme results'!$B$3:$D$14,3,FALSE),\"\")","v":""},{"$f":"IFERROR(VLOOKUP($B11,'2017 extreme results'!$B$22:$D$31,3,FALSE),\"\")","v":22},{"$f":"IFERROR(VLOOKUP($B11,'2017 extreme results'!$B$34:$D$49,3,FALSE),\"\")","v":""},{"$f":"IFERROR(VLOOKUP($B11,'2017 extreme results'!$B$53:$D$64,3,FALSE),\"\")","v":""},{"$f":"IFERROR(VLOOKUP($B11,'2017 extreme results'!$B$68:$D$79,3,FALSE),\"\")","v":""},22,22,1,22,"","",1]
[{"$f":"RANK(J12,$J$5:$J$39,0)","v":7},"Simon Bellwood ",{"$f":"VLOOKUP(B12,'Age Cat'!F:G,2,FALSE)","v":"V50"},{"$f":"IFERROR(VLOOKUP($B12,'2017 extreme results'!$B$3:$D$14,3,FALSE),\"\")","v":22},{"$f":"IFERROR(VLOOKUP($B12,'2017 extreme results'!$B$22:$D$31,3,FALSE),\"\")","v":""},{"$f":"IFERROR(VLOOKUP($B12,'2017 extreme results'!$B$34:$D$49,3,FALSE),\"\")","v":""},{"$f":"IFERROR(VLOOKUP($B12,'2017 extreme results'!$B$53:$D$64,3,FALSE),\"\")","v":""},{"$f":"IFERROR(VLOOKUP($B12,'2017 extreme results'!$B$68:$D$79,3,FALSE),\"\")","v":""},22,22,1,22,"","",1]
[{"$f":"RANK(J13,$J$5:$J$39,0)","v":9},"Rick Harwood",null,{"$f":"IFERROR(VLOOKUP($B13,'2017 extreme results'!$B$3:$D$14,3,FALSE),\"\")","v":""},{"$f":"IFERROR(VLOOKUP($B13,'2017 extreme results'!$B$22:$D$31,3,FALSE),\"\")","v":21},{"$f":"IFERROR(VLOOKUP($B13,'2017 extreme results'!$B$34:$D$49,3,FALSE),\"\")","v":""},{"$f":"IFERROR(VLOOKUP($B13,'2017 extreme results'!$B$53:$D$64,3,FALSE),\"\")","v":""},{"$f":"IFERROR(VLOOKUP($B13,'2017 extreme results'!$B$68:$D$79,3,FALSE),\"\")","v":""},21,21,1,21,"","",1]
[{"$f":"RANK(J14,$J$5:$J$39,0)","v":9},"Russell Fairhurst",{"$f":"VLOOKUP(B14,'Age Cat'!F:G,2,FALSE)","v":"V50"},{"$f":"IFERROR(VLOOKUP($B14,'2017 extreme results'!$B$3:$D$14,3,FALSE),\"\")","v":21},{"$f":"IFERROR(VLOOKUP($B14,'2017 extreme results'!$B$22:$D$31,3,FALSE),\"\")","v":""},{"$f":"IFERROR(VLOOKUP($B14,'2017 extreme results'!$B$34:$D$49,3,FALSE),\"\")","v":""},{"$f":"IFERROR(VLOOKUP($B14,'2017 extreme results'!$B$53:$D$64,3,FALSE),\"\")","v":""},{"$f":"IFERROR(VLOOKUP($B14,'2017 extreme results'!$B$68:$D$79,3,FALSE),\"\")","v":""},21,21,1,{"$f":"IFERROR(LARGE($D14:$H14,D$3),\"\")","v":21},{"$f":"IFERROR(LARGE($D14:$H14,E$3),\"\")","v":""},{"$f":"IFERROR(LARGE($D14:$H14,F$3),\"\")","v":""},1]
[{"$f":"RANK(J15,$J$5:$J$39,0)","v":12},"Steve Carter ",{"$f":"VLOOKUP(B15,'Age Cat'!F:G,2,FALSE)","v":"V60"},{"$f":"IFERROR(VLOOKUP($B15,'2017 extreme results'!$B$3:$D$14,3,FALSE),\"\")","v":19},{"$f":"IFERROR(VLOOKUP($B15,'2017 extreme results'!$B$22:$D$31,3,FALSE),\"\")","v":""},{"$f":"IFERROR(VLOOKUP($B15,'2017 extreme results'!$B$34:$D$49,3,FALSE),\"\")","v":""},{"$f":"IFERROR(VLOOKUP($B15,'2017 extreme results'!$B$53:$D$64,3,FALSE),\"\")","v":""},{"$f":"IFERROR(VLOOKUP($B15,'2017 extreme results'!$B$68:$D$79,3,FALSE),\"\")","v":""},19,19,1,19,"","",1]
[{"$f":"RANK(J16,$J$5:$J$39,0)","v":14},"Russell Aydon-Butler",null,{"$f":"IFERROR(VLOOKUP($B16,'2017 extreme results'!$B$3:$D$14,3,FALSE),\"\")","v":""},{"$f":"IFERROR(VLOOKUP($B16,'2017 extreme results'!$B$22:$D$31,3,FALSE),\"\")","v":18},{"$f":"IFERROR(VLOOKUP($B16,'2017 extreme results'!$B$34:$D$49,3,FALSE),\"\")","v":""},{"$f":"IFERROR(VLOOKUP($B16,'2017 extreme results'!$B$53:$D$64,3,FALSE),\"\")","v":""},{"$f":"IFERROR(VLOOKUP($B16,'2017 extreme results'!$B$68:$D$79,3,FALSE),\"\")","v":""},{"$f":"IF(SUM(D16:H16)=0,\"\",SUM(D16:H16))","v":18},{"$f":"SUM(L16:N16)","v":18},{"$f":"IF(COUNT(D16:H16)=0,\"\",COUNT(D16:H16))","v":1},{"$f":"IFERROR(LARGE($D16:$H16,D$3),\"\")","v":18},{"$f":"IFERROR(LARGE($D16:$H16,E$3),\"\")","v":""},{"$f":"IFERROR(LARGE($D16:$H16,F$3),\"\")","v":""},{"$f":"COUNT(L16:N16)","v":1}]
[{"$f":"RANK(J17,$J$5:$J$39,0)","v":14},"Ian Rodgers",null,{"$f":"IFERROR(VLOOKUP($B17,'2017 extreme results'!$B$3:$D$14,3,FALSE),\"\")","v":18},{"$f":"IFERROR(VLOOKUP($B17,'2017 extreme results'!$B$22:$D$31,3,FALSE),\"\")","v":""},{"$f":"IFERROR(VLOOKUP($B17,'2017 extreme results'!$B$34:$D$49,3,FALSE),\"\")","v":""},{"$f":"IFERROR(VLOOKUP($B17,'2017 extreme results'!$B$53:$D$64,3,FALSE),\"\")","v":""},{"$f":"IFERROR(VLOOKUP($B17,'2017 extreme results'!$B$68:$D$79,3,FALSE),\"\")","v":""},18,18,1,18,"","",1]
[{"$f":"RANK(J18,$J$5:$J$39,0)","v":16},"David Copping",{"$f":"VLOOKUP(B18,'Age Cat'!F:G,2,FALSE)","v":"V50"},{"$f":"IFERROR(VLOOKUP($B18,'2017 extreme results'!$B$3:$D$14,3,FALSE),\"\")","v":""},{"$f":"IFERROR(VLOOKUP($B18,'2017 extreme results'!$B$22:$D$31,3,FALSE),\"\")","v":17},{"$f":"IFERROR(VLOOKUP($B18,'2017 extreme results'!$B$34:$D$49,3,FALSE),\"\")","v":""},{"$f":"IFERROR(VLOOKUP($B18,'2017 extreme results'!$B$53:$D$64,3,FALSE),\"\")","v":""},{"$f":"IFERROR(VLOOKUP($B18,'2017 extreme results'!$B$68:$D$79,3,FALSE),\"\")","v":""},17,17,1,17,"","",1]
[{"$f":"RANK(J19,$J$5:$J$39,0)","v":17},"Andrew Travis",{"$f":"VLOOKUP(B19,'Age Cat'!F:G,2,FALSE)","v":"V40"},{"$f":"IFERROR(VLOOKUP($B19,'2017 extreme results'!$B$3:$D$14,3,FALSE),\"\")","v":""},{"$f":"IFERROR(VLOOKUP($B19,'2017 extreme results'!$B$22:$D$31,3,FALSE),\"\")","v":16},{"$f":"IFERROR(VLOOKUP($B19,'2017 extreme results'!$B$34:$D$49,3,FALSE),\"\")","v":""},{"$f":"IFERROR(VLOOKUP($B19,'2017 extreme results'!$B$53:$D$64,3,FALSE),\"\")","v":""},{"$f":"IFERROR(VLOOKUP($B19,'2017 extreme results'!$B$68:$D$79,3,FALSE),\"\")","v":""},16,16,1,16,"","",1]
[{"$f":"RANK(J20,$J$5:$J$39,0)","v":18},"Dan Timbers",null,{"$f":"IFERROR(VLOOKUP($B20,'2017 extreme results'!$B$3:$D$14,3,FALSE),\"\")","v":""},{"$f":"IFERROR(VLOOKUP($B20,'2017 extreme results'!$B$22:$D$31,3,FALSE),\"\")","v":""},{"$f":"IFERROR(VLOOKUP($B20,'2017 extreme results'!$B$34:$D$49,3,FALSE),\"\")","v":13},{"$f":"IFERROR(VLOOKUP($B20,'2017 extreme results'!$B$53:$D$64,3,FALSE),\"\")","v":""},{"$f":"IFERROR(VLOOKUP($B20,'2017 extreme results'!$B$68:$D$79,3,FALSE),\"\")","v":""},13,13,1,13,"","",1]
[{"$f":"RANK(J21,$J$5:$J$39,0)","v":20},"Alistair Gavins ",{"$f":"VLOOKUP(B21,'Age Cat'!F:G,2,FALSE)","v":"V50"},{"$f":"IFERROR(VLOOKUP($B21,'2017 extreme results'!$B$3:$D$14,3,FALSE),\"\")","v":""},{"$f":"IFERROR(VLOOKUP($B21,'2017 extreme results'!$B$22:$D$31,3,FALSE),\"\")","v":""},{"$f":"IFERROR(VLOOKUP($B21,'2017 extreme results'!$B$34:$D$49,3,FALSE),\"\")","v":""},{"$f":"IFERROR(VLOOKUP($B21,'2017 extreme results'!$B$53:$D$64,3,FALSE),\"\")","v":""},{"$f":"IFERROR(VLOOKUP($B21,'2017 extreme results'!$B$68:$D$79,3,FALSE),\"\")","v":""},"",0,"","","","",0]
[{"$f":"RANK(J22,$J$5:$J$39,0)","v":20},"Peter Smith",{"$f":"VLOOKUP(B22,'Age Cat'!F:G,2,FALSE)","v":"V30"},{"$f":"IFERROR(VLOOKUP($B22,'2017 extreme results'!$B$3:$D$15,3,FALSE),\"\")","v":""},{"$f":"IFERROR(VLOOKUP($B22,'2017 extreme results'!$B$22:$D$31,3,FALSE),\"\")","v":""},{"$f":"IFERROR(VLOOKUP($B22,'2017 extreme results'!$B$34:$D$49,3,FALSE),\"\")","v":""},{"$f":"IFERROR(VLOOKUP($B22,'2017 extreme results'!$B$53:$D$64,3,FALSE),\"\")","v":""},{"$f":"IFERROR(VLOOKUP($B22,'2017 extreme results'!$B$68:$D$79,3,FALSE),\"\")","v":""},"",{"$f":"SUM(L22:N22)","v":0},"","","","",{"$f":"COUNT(L22:N22)","v":0}]
[2,"Ian Willis",null,{"$f":"IFERROR(VLOOKUP($B23,'2017 extreme results'!$B$3:$D$14,3,FALSE),\"\")","v":""},{"$f":"IFERROR(VLOOKUP($B23,'2017 extreme results'!$B$22:$D$31,3,FALSE),\"\")","v":""},{"$f":"IFERROR(VLOOKUP($B23,'2017 extreme results'!$B$34:$D$49,3,FALSE),\"\")","v":""},{"$f":"IFERROR(VLOOKUP($B23,'2017 extreme results'!$B$53:$D$64,3,FALSE),\"\")","v":""},{"$f":"IFERROR(VLOOKUP($B23,'2017 extreme results'!$B$68:$D$79,3,FALSE),\"\")","v":""},"",0,"","","","",0]
[3,"Alfie Walker",null,{"$f":"IFERROR(VLOOKUP($B24,'2017 extreme results'!$B$3:$D$14,3,FALSE),\"\")","v":""},{"$f":"IFERROR(VLOOKUP($B24,'2017 extreme results'!$B$22:$D$31,3,FALSE),\"\")","v":""},{"$f":"IFERROR(VLOOKUP($B24,'2017 extreme results'!$B$34:$D$49,3,FALSE),\"\")","v":""},{"$f":"IFERROR(VLOOKUP($B24,'2017 extreme results'!$B$53:$D$64,3,FALSE),\"\")","v":""},{"$f":"IFERROR(VLOOKUP($B24,'2017 extreme results'!$B$68:$D$79,3,FALSE),\"\")","v":""},"",0,"","","","",0]
[4,"Paul Crabtree",null,{"$f":"IFERROR(VLOOKUP($B25,'2017 extreme results'!$B$3:$D$14,3,FALSE),\"\")","v":""},{"$f":"IFERROR(VLOOKUP($B25,'2017 extreme results'!$B$22:$D$31,3,FALSE),\"\")","v":""},{"$f":"IFERROR(VLOOKUP($B25,'2017 extreme results'!$B$34:$D$49,3,FALSE),\"\")","v":""},{"$f":"IFERROR(VLOOKUP($B25,'2017 extreme results'!$B$53:$D$64,3,FALSE),\"\")","v":""},{"$f":"IFERROR(VLOOKUP($B25,'2017 extreme results'!$B$68:$D$79,3,FALSE),\"\")","v":""},"",0,"","","","",0]
[5,"Dave Copping",null,{"$f":"IFERROR(VLOOKUP($B26,'2017 extreme results'!$B$3:$D$14,3,FALSE),\"\")","v":""},{"$f":"IFERROR(VLOOKUP($B26,'2017 extreme results'!$B$22:$D$31,3,FALSE),\"\")","v":""},{"$f":"IFERROR(VLOOKUP($B26,'2017 extreme results'!$B$34:$D$49,3,FALSE),\"\")","v":""},{"$f":"IFERROR(VLOOKUP($B26,'2017 extreme results'!$B$53:$D$64,3,FALSE),\"\")","v":""},{"$f":"IFERROR(VLOOKUP($B26,'2017 extreme results'!$B$68:$D$79,3,FALSE),\"\")","v":""},"",0,"","","","",0]
[6,"Peter Lloyd",null,{"$f":"IFERROR(VLOOKUP($B27,'2017 extreme results'!$B$3:$D$14,3,FALSE),\"\")","v":""},{"$f":"IFERROR(VLOOKUP($B27,'2017 extreme results'!$B$22:$D$31,3,FALSE),\"\")","v":19},{"$f":"IFERROR(VLOOKUP($B27,'2017 extreme results'!$B$34:$D$49,3,FALSE),\"\")","v":""},{"$f":"IFERROR(VLOOKUP($B27,'2017 extreme results'!$B$53:$D$64,3,FALSE),\"\")","v":""},{"$f":"IFERROR(VLOOKUP($B27,'2017 extreme results'!$B$68:$D$79,3,FALSE),\"\")","v":""},19,19,1,19,"","",1]
[8,"Tim Thom",null,{"$f":"IFERROR(VLOOKUP($B28,'2017 extreme results'!$B$3:$D$14,3,FALSE),\"\")","v":""},{"$f":"IFERROR(VLOOKUP($B28,'2017 extreme results'!$B$22:$D$31,3,FALSE),\"\")","v":""},{"$f":"IFERROR(VLOOKUP($B28,'2017 extreme results'!$B$34:$D$49,3,FALSE),\"\")","v":11},{"$f":"IFERROR(VLOOKUP($B28,'2017 extreme results'!$B$53:$D$64,3,FALSE),\"\")","v":""},{"$f":"IFERROR(VLOOKUP($B28,'2017 extreme results'!$B$68:$D$79,3,FALSE),\"\")","v":""},11,11,1,11,"","",1]
[9,"Paul Sessford",null,{"$f":"IFERROR(VLOOKUP($B29,'2017 extreme results'!$B$3:$D$14,3,FALSE),\"\")","v":""},{"$f":"IFERROR(VLOOKUP($B29,'2017 extreme results'!$B$22:$D$31,3,FALSE),\"\")","v":""},{"$f":"IFERROR(VLOOKUP($B29,'2017 extreme results'!$B$34:$D$49,3,FALSE),\"\")","v":""},{"$f":"IFERROR(VLOOKUP($B29,'2017 extreme results'!$B$53:$D$64,3,FALSE),\"\")","v":""},{"$f":"IFERROR(VLOOKUP($B29,'2017 extreme results'!$B$68:$D$79,3,FALSE),\"\")","v":""},"",0,"","","","",0]
[10,"Tony Booth",null,{"$f":"IFERROR(VLOOKUP($B30,'2017 extreme results'!$B$3:$D$14,3,FALSE),\"\")","v":""},{"$f":"IFERROR(VLOOKUP($B30,'2017 extreme results'!$B$22:$D$31,3,FALSE),\"\")","v":""},{"$f":"IFERROR(VLOOKUP($B30,'2017 extreme results'!$B$34:$D$49,3,FALSE),\"\")","v":""},{"$f":"IFERROR(VLOOKUP($B30,'2017 extreme results'!$B$53:$D$64,3,FALSE),\"\")","v":""},{"$f":"IFERROR(VLOOKUP($B30,'2017 extreme results'!$B$68:$D$79,3,FALSE),\"\")","v":""},"",0,"","","","",0]
[11,"Alan Turner",null,{"$f":"IFERROR(VLOOKUP($B31,'2017 extreme results'!$B$3:$D$14,3,FALSE),\"\")","v":""},{"$f":"IFERROR(VLOOKUP($B31,'2017 extreme results'!$B$22:$D$31,3,FALSE),\"\")","v":""},{"$f":"IFERROR(VLOOKUP($B31,'2017 extreme results'!$B$34:$D$49,3,FALSE),\"\")","v":""},{"$f":"IFERROR(VLOOKUP($B31,'2017 extreme results'!$B$53:$D$64,3,FALSE),\"\")","v":""},{"$f":"IFERROR(VLOOKUP($B31,'2017 extreme results'!$B$68:$D$79,3,FALSE),\"\")","v":""},"",0,"","","","",0]
[12,"John Conroy",null,{"$f":"IFERROR(VLOOKUP($B32,'2017 extreme results'!$B$3:$D$14,3,FALSE),\"\")","v":""},{"$f":"IFERROR(VLOOKUP($B32,'2017 extreme results'!$B$22:$D$31,3,FALSE),\"\")","v":20},{"$f":"IFERROR(VLOOKUP($B32,'2017 extreme results'!$B$34:$D$49,3,FALSE),\"\")","v":""},{"$f":"IFERROR(VLOOKUP($B32,'2017 extreme results'!$B$53:$D$64,3,FALSE),\"\")","v":""},{"$f":"IFERROR(VLOOKUP($B32,'2017 extreme results'!$B$68:$D$79,3,FALSE),\"\")","v":""},20,20,1,20,"","",1]
[21,"Stuart Walton",null,{"$f":"IFERROR(VLOOKUP($B33,'2017 extreme results'!$B$3:$D$14,3,FALSE),\"\")","v":""},{"$f":"IFERROR(VLOOKUP($B33,'2017 extreme results'!$B$22:$D$31,3,FALSE),\"\")","v":""},{"$f":"IFERROR(VLOOKUP($B33,'2017 extreme results'!$B$34:$D$49,3,FALSE),\"\")","v":""},{"$f":"IFERROR(VLOOKUP($B33,'2017 extreme results'!$B$53:$D$64,3,FALSE),\"\")","v":""},{"$f":"IFERROR(VLOOKUP($B33,'2017 extreme results'!$B$68:$D$79,3,FALSE),\"\")","v":""},"",0,"","","","",0]
[22,"Joe Atherton",null,{"$f":"IFERROR(VLOOKUP($B34,'2017 extreme results'!$B$3:$D$14,3,FALSE),\"\")","v":""},{"$f":"IFERROR(VLOOKUP($B34,'2017 extreme results'!$B$22:$D$31,3,FALSE),\"\")","v":""},{"$f":"IFERROR(VLOOKUP($B34,'2017 extreme results'!$B$34:$D$49,3,FALSE),\"\")","v":""},{"$f":"IFERROR(VLOOKUP($B34,'2017 extreme results'!$B$53:$D$64,3,FALSE),\"\")","v":""},{"$f":"IFERROR(VLOOKUP($B34,'2017 extreme results'!$B$68:$D$79,3,FALSE),\"\")","v":""},"",0,"","","","",0,null,null," "]
[23,"Gary Ward ",null,{"$f":"IFERROR(VLOOKUP($B35,'2017 extreme results'!$B$3:$D$14,3,FALSE),\"\")","v":""},{"$f":"IFERROR(VLOOKUP($B35,'2017 extreme results'!$B$22:$D$31,3,FALSE),\"\")","v":""},{"$f":"IFERROR(VLOOKUP($B35,'2017 extreme results'!$B$34:$D$49,3,FALSE),\"\")","v":""},{"$f":"IFERROR(VLOOKUP($B35,'2017 extreme results'!$B$53:$D$64,3,FALSE),\"\")","v":""},{"$f":"IFERROR(VLOOKUP($B35,'2017 extreme results'!$B$68:$D$79,3,FALSE),\"\")","v":""},"",0,"","","","",0]
[24,"Gary Chapman",null,{"$f":"IFERROR(VLOOKUP($B36,'2017 extreme results'!$B$3:$D$14,3,FALSE),\"\")","v":""},{"$f":"IFERROR(VLOOKUP($B36,'2017 extreme results'!$B$22:$D$31,3,FALSE),\"\")","v":""},{"$f":"IFERROR(VLOOKUP($B36,'2017 extreme results'!$B$34:$D$49,3,FALSE),\"\")","v":""},{"$f":"IFERROR(VLOOKUP($B36,'2017 extreme results'!$B$53:$D$64,3,FALSE),\"\")","v":""},{"$f":"IFERROR(VLOOKUP($B36,'2017 extreme results'!$B$68:$D$79,3,FALSE),\"\")","v":""},"",0,"","","","",0]
[25,"Chris Tomes",null,{"$f":"IFERROR(VLOOKUP($B37,'2017 extreme results'!$B$3:$D$14,3,FALSE),\"\")","v":""},{"$f":"IFERROR(VLOOKUP($B37,'2017 extreme results'!$B$22:$D$31,3,FALSE),\"\")","v":""},{"$f":"IFERROR(VLOOKUP($B37,'2017 extreme results'!$B$34:$D$49,3,FALSE),\"\")","v":""},{"$f":"IFERROR(VLOOKUP($B37,'2017 extreme results'!$B$53:$D$64,3,FALSE),\"\")","v":""},{"$f":"IFERROR(VLOOKUP($B37,'2017 extreme results'!$B$68:$D$79,3,FALSE),\"\")","v":""},"",0,"","","","",0]
[26,"Nick Dewell",null,{"$f":"IFERROR(VLOOKUP($B38,'2017 extreme results'!$B$3:$D$14,3,FALSE),\"\")","v":""},{"$f":"IFERROR(VLOOKUP($B38,'2017 extreme results'!$B$22:$D$31,3,FALSE),\"\")","v":""},{"$f":"IFERROR(VLOOKUP($B38,'2017 extreme results'!$B$34:$D$49,3,FALSE),\"\")","v":""},{"$f":"IFERROR(VLOOKUP($B38,'2017 extreme results'!$B$53:$D$64,3,FALSE),\"\")","v":""},{"$f":"IFERROR(VLOOKUP($B38,'2017 extreme results'!$B$68:$D$79,3,FALSE),\"\")","v":""},"",0,"","","","",0]
[27,"Neil Palmer",null,{"$f":"IFERROR(VLOOKUP($B39,'2017 extreme results'!$B$3:$D$14,3,FALSE),\"\")","v":""},{"$f":"IFERROR(VLOOKUP($B39,'2017 extreme results'!$B$22:$D$31,3,FALSE),\"\")","v":""},{"$f":"IFERROR(VLOOKUP($B39,'2017 extreme results'!$B$34:$D$49,3,FALSE),\"\")","v":""},{"$f":"IFERROR(VLOOKUP($B39,'2017 extreme results'!$B$53:$D$64,3,FALSE),\"\")","v":""},{"$f":"IFERROR(VLOOKUP($B39,'2017 extreme results'!$B$68:$D$79,3,FALSE),\"\")","v":""},"",0,"","","","",0]
[28,"Richard Hindle",null,{"$f":"IFERROR(VLOOKUP($B40,'2017 extreme results'!$B$3:$D$14,3,FALSE),\"\")","v":""},{"$f":"IFERROR(VLOOKUP($B40,'2017 extreme results'!$B$22:$D$31,3,FALSE),\"\")","v":""},{"$f":"IFERROR(VLOOKUP($B40,'2017 extreme results'!$B$34:$D$49,3,FALSE),\"\")","v":""},{"$f":"IFERROR(VLOOKUP($B40,'2017 extreme results'!$B$53:$D$64,3,FALSE),\"\")","v":""},{"$f":"IFERROR(VLOOKUP($B40,'2017 extreme results'!$B$68:$D$79,3,FALSE),\"\")","v":""},"",0,"","","","",0]
[29,"Arthur Leng",null,{"$f":"IFERROR(VLOOKUP($B41,'2017 extreme results'!$B$3:$D$14,3,FALSE),\"\")","v":""},{"$f":"IFERROR(VLOOKUP($B41,'2017 extreme results'!$B$22:$D$31,3,FALSE),\"\")","v":""},{"$f":"IFERROR(VLOOKUP($B41,'2017 extreme results'!$B$34:$D$49,3,FALSE),\"\")","v":""},{"$f":"IFERROR(VLOOKUP($B41,'2017 extreme results'!$B$53:$D$64,3,FALSE),\"\")","v":""},{"$f":"IFERROR(VLOOKUP($B41,'2017 extreme results'!$B$68:$D$79,3,FALSE),\"\")","v":""},"",0,"","","","",0]
[]
["Pos","Name",null,1,2,3,4,5,"Total","Scoring Total","# Races","Top 3 results"]
[null,null,null,{"$f":"VLOOKUP(D43,$A$57:$C$65,2,FALSE)","v":"2017-02-04"},{"$f":"VLOOKUP(E43,$A$57:$C$65,2,FALSE)","v":"2017-04-29"},{"$f":"VLOOKUP(F43,$A$57:$C$65,2,FALSE)","v":"2017-06-10"},{"$f":"VLOOKUP(G43,$A$57:$C$65,2,FALSE)","v":"2017-08-05"},{"$f":"VLOOKUP(H43,$A$57:$C$65,2,FALSE)","v":"2017-11-18"},null,null,null,{"$f":"D43","v":1},{"$f":"E43","v":2},{"$f":"F43","v":3}]
[{"$f":"RANK(J45,$J$45:$J$55,0)","v":1},"Diane Macdonald",{"$f":"VLOOKUP(B45,'Age Cat'!F:G,2,FALSE)","v":"V40"},{"$f":"IFERROR(VLOOKUP($B45,'2017 extreme results'!$B$3:$D$14,3,FALSE),\"\")","v":25},{"$f":"IFERROR(VLOOKUP($B45,'2017 extreme results'!$B$22:$D$31,3,FALSE),\"\")","v":""},{"$f":"IFERROR(VLOOKUP($B45,'2017 extreme results'!$B$34:$D$49,3,FALSE),\"\")","v":""},null,null,{"$f":"IF(SUM(D45:H45)=0,\"\",SUM(D45:H45))","v":25},{"$f":"SUM(L45:N45)","v":25},{"$f":"IF(COUNT(D45:H45)=0,\"\",COUNT(D45:H45))","v":1},{"$f":"IFERROR(LARGE($D45:$H45,D$3),\"\")","v":25},"","",{"$f":"COUNT(L45:N45)","v":1}]
[{"$f":"RANK(J46,$J$45:$J$55,0)","v":1},"Angela Paxton",{"$f":"VLOOKUP(B46,'Age Cat'!F:G,2,FALSE)","v":"V50"},{"$f":"IFERROR(VLOOKUP($B46,'2017 extreme results'!$B$3:$D$14,3,FALSE),\"\")","v":""},{"$f":"IFERROR(VLOOKUP($B46,'2017 extreme results'!$B$22:$D$31,3,FALSE),\"\")","v":""},{"$f":"IFERROR(VLOOKUP($B46,'2017 extreme results'!$B$34:$D$49,3,FALSE),\"\")","v":25},null,null,{"$f":"IF(SUM(D46:H46)=0,\"\",SUM(D46:H46))","v":25},{"$f":"SUM(L46:N46)","v":25},{"$f":"IF(COUNT(D46:H46)=0,\"\",COUNT(D46:H46))","v":1},{"$f":"IFERROR(LARGE($D46:$H46,D$3),\"\")","v":25},{"$f":"IFERROR(LARGE($D46:$H46,E$3),\"\")","v":""},{"$f":"IFERROR(LARGE($D46:$H46,F$3),\"\")","v":""},{"$f":"COUNT(L46:N46)","v":1}]
[{"$f":"RANK(J47,$J$45:$J$55,0)","v":3},"Sharon Hudson",{"$f":"VLOOKUP(B47,'Age Cat'!F:G,2,FALSE)","v":"V40"},{"$f":"IFERROR(VLOOKUP($B47,'2017 extreme results'!$B$3:$D$14,3,FALSE),\"\")","v":""},{"$f":"IFERROR(VLOOKUP($B47,'2017 extreme results'!$B$22:$D$31,3,FALSE),\"\")","v":""},{"$f":"IFERROR(VLOOKUP($B47,'2017 extreme results'!$B$34:$D$49,3,FALSE),\"\")","v":24},null,null,24,24,1,24,"","",1]
[{"$f":"RANK(J48,$J$45:$J$55,0)","v":3},"Hannah Yates",{"$f":"VLOOKUP(B48,'Age Cat'!F:G,2,FALSE)","v":"S"},{"$f":"IFERROR(VLOOKUP($B48,'2017 extreme results'!$B$3:$D$14,3,FALSE),\"\")","v":24},{"$f":"IFERROR(VLOOKUP($B48,'2017 extreme results'!$B$22:$D$31,3,FALSE),\"\")","v":""},{"$f":"IFERROR(VLOOKUP($B48,'2017 extreme results'!$B$34:$D$49,3,FALSE),\"\")","v":""},null,null,24,24,1,24,"","",1]
[{"$f":"RANK(J49,$J$45:$J$55,0)","v":5},"Amanda Sterling",{"$f":"VLOOKUP(B49,'Age Cat'!F:G,2,FALSE)","v":"V40"},{"$f":"IFERROR(VLOOKUP($B49,'2017 extreme results'!$B$3:$D$14,3,FALSE),\"\")","v":""},{"$f":"IFERROR(VLOOKUP($B49,'2017 extreme results'!$B$22:$D$31,3,FALSE),\"\")","v":""},{"$f":"IFERROR(VLOOKUP($B49,'2017 extreme results'!$B$34:$D$49,3,FALSE),\"\")","v":23},null,null,23,23,1,23,"","",1]
[{"$f":"RANK(J50,$J$45:$J$55,0)","v":5},"Donna Chester",{"$f":"VLOOKUP(B50,'Age Cat'!F:G,2,FALSE)","v":"V30"},{"$f":"IFERROR(VLOOKUP($B50,'2017 extreme results'!$B$3:$D$14,3,FALSE),\"\")","v":23},{"$f":"IFERROR(VLOOKUP($B50,'2017 extreme results'!$B$22:$D$31,3,FALSE),\"\")","v":""},{"$f":"IFERROR(VLOOKUP($B50,'2017 extreme results'!$B$34:$D$49,3,FALSE),\"\")","v":""},null,null,23,23,1,23,"","",1]
[{"$f":"RANK(J51,$J$45:$J$55,0)","v":7},"Hannah Thom",{"$f":"VLOOKUP(B51,'Age Cat'!F:G,2,FALSE)","v":"S"},{"$f":"IFERROR(VLOOKUP($B51,'2017 extreme results'!$B$3:$D$14,3,FALSE),\"\")","v":""},{"$f":"IFERROR(VLOOKUP($B51,'2017 extreme results'!$B$22:$D$31,3,FALSE),\"\")","v":""},{"$f":"IFERROR(VLOOKUP($B51,'2017 extreme results'!$B$34:$D$49,3,FALSE),\"\")","v":22},null,null,22,22,1,22,"","",1]
[{"$f":"RANK(J52,$J$45:$J$55,0)","v":7},"Victoria Wadsworth ",{"$f":"VLOOKUP(B52,'Age Cat'!F:G,2,FALSE)","v":"V40"},{"$f":"IFERROR(VLOOKUP($B52,'2017 extreme results'!$B$3:$D$14,3,FALSE),\"\")","v":22},{"$f":"IFERROR(VLOOKUP($B52,'2017 extreme results'!$B$22:$D$31,3,FALSE),\"\")","v":""},{"$f":"IFERROR(VLOOKUP($B52,'2017 extreme results'!$B$34:$D$49,3,FALSE),\"\")","v":""},null,null,22,22,1,22,"","",1]
[5,"Jane Sedgwick","F",{"$f":"IFERROR(VLOOKUP($B53,'2017 extreme results'!$B$3:$D$14,3,FALSE),\"\")","v":""},{"$f":"IFERROR(VLOOKUP($B53,'2017 extreme results'!$B$22:$D$31,3,FALSE),\"\")","v":""},{"$f":"IFERROR(VLOOKUP($B53,'2017 extreme results'!$B$34:$D$49,3,FALSE),\"\")","v":""},null,null,"",0,"","","","",0]
[9,"Emma Dooks","F",{"$f":"IFERROR(VLOOKUP($B54,'2017 extreme results'!$B$3:$D$14,3,FALSE),\"\")","v":""},{"$f":"IFERROR(VLOOKUP($B54,'2017 extreme results'!$B$22:$D$31,3,FALSE),\"\")","v":""},{"$f":"IFERROR(VLOOKUP($B54,'2017 extreme results'!$B$34:$D$49,3,FALSE),\"\")","v":""},null,null,"",0,"","","","",0]
[10,"Amanda Morrison","F",{"$f":"IFERROR(VLOOKUP($B55,'2017 extreme results'!$B$3:$D$14,3,FALSE),\"\")","v":""},{"$f":"IFERROR(VLOOKUP($B55,'2017 extreme results'!$B$22:$D$31,3,FALSE),\"\")","v":""},{"$f":"IFERROR(VLOOKUP($B55,'2017 extreme results'!$B$34:$D$49,3,FALSE),\"\")","v":""},null,null,"",0,"","","","",0]
[]
[1,"2017-02-04","Rombald Stride 23m"]
[2,"2017-04-29","3 Peaks 23.2m"]
[3,"2017-06-10","Ennerdale 22.9m"]
[4,"2017-08-05","Borrowdale 16.8m"]
[5,"2017-11-18","Full Tour of Pendle 16.8m"]

{"sheet":"2017 fell Table","index":3,"n_rows":48,"n_cols":24,"rows_kept":48,"cut":false,"hidden":false,"merged":[[38,3,38,11],[38,12,38,14],[49,1,49,13],[2,15,2,19],[29,0,30,0],[29,1,30,1],[29,12,30,12],[29,13,30,13],[29,14,30,14],[29,15,29,19],[2,14,3,14],[0,0,1,1],[2,0,3,0],[2,1,3,1],[2,12,3,12],[2,13,3,13]]}
["2017 - Fell\n(Best 5 of 9 Races)"]
[null,null,null,{"$f":"VLOOKUP(D3,$A$40:$C$48,3,FALSE)","v":"Hoofstones"},"Bleasdale Circle","Stan Bradshaw Pendle Round","Coledale Horseshoe","Oakworth Haul","Grisedale Horseshoe","Great Whernside","Mytholmroyd","Guisborough Wood"]
["Pos","Name",null,1,2,3,4,5,6,7,8,9,"Total","Scoring Total","# Races","Top 5 Results"]
[null,null,null,{"$f":"VLOOKUP(D3,$A$40:$C$48,2,FALSE)","v":"2017-01-28"},"2017-02-18","2017-03-04","2017-04-08","2017-07-01","2017-09-02","2017-09-23","2017-12-09","2017-12-27",null,null,null,{"$f":"D3","v":1},2,3,4,5]
[{"$f":"RANK(M5,$M$5:$M$18,0)","v":1},"John-Paul Hopkinson",{"$f":"VLOOKUP(B5,'Age Cat'!F:G,2,FALSE)","v":"V40"},{"$f":"IFERROR(VLOOKUP($B5,'2017 fell results'!$B$3:$D$14,3,FALSE),\"\")","v":25},{"$f":"IFERROR(VLOOKUP($B5,'2017 fell results'!$B$18:$D$29,3,FALSE),\"\")","v":24},{"$f":"IFERROR(VLOOKUP($B5,'2017 fell results'!$B$35:$D$52,3,FALSE),\"\")","v":24},{"$f":"IFERROR(VLOOKUP($B5,'2017 fell results'!$B$52:$D$63,3,FALSE),\"\")","v":23},{"$f":"IFERROR(VLOOKUP($B5,'2017 fell results'!$B$67:$D$78,3,FALSE),\"\")","v":""},{"$f":"IFERROR(VLOOKUP($B5,'2017 fell results'!$B$82:$D$93,3,FALSE),\"\")","v":""},{"$f":"IFERROR(VLOOKUP($B5,'2017 fell results'!$B$97:$D$108,3,FALSE),\"\")","v":""},{"$f":"IFERROR(VLOOKUP($B5,'2017 fell results'!$B$112:$D$123,3,FALSE),\"\")","v":""},{"$f":"IFERROR(VLOOKUP($B5,'2017 fell results'!$B$127:$D$138,3,FALSE),\"\")","v":""},{"$f":"IF(SUM(D5:L5)=0,\"\",SUM(D5:L5))","v":96},{"$f":"SUM(P5:T5)","v":96},{"$f":"IF(COUNT(D5:L5)=0,\"\",COUNT(D5:L5))","v":4},{"$f":"IFERROR(LARGE($D5:$L5,D$3),\"\")","v":25},{"$f":"IFERROR(LARGE($D5:$L5,E$3),\"\")","v":24},24,23,"",{"$f":"COUNT(P5:T5)","v":4}]
[{"$f":"RANK(M6,$M$5:$M$18,0)","v":2},"Paul Crabtree",{"$f":"VLOOKUP(B6,'Age Cat'!F:G,2,FALSE)","v":"V40"},{"$f":"IFERROR(VLOOKUP($B6,'2017 fell results'!$B$3:$D$14,3,FALSE),\"\")","v":22},{"$f":"IFERROR(VLOOKUP($B6,'2017 fell results'!$B$18:$D$29,3,FALSE),\"\")","v":23},{"$f":"IFERROR(VLOOKUP($B6,'2017 fell results'!$B$35:$D$52,3,FALSE),\"\")","v":25},{"$f":"IFERROR(VLOOKUP($B6,'2017 fell results'!$B$52:$D$63,3,FALSE),\"\")","v":25},{"$f":"IFERROR(VLOOKUP($B6,'2017 fell results'!$B$67:$D$78,3,FALSE),\"\")","v":""},{"$f":"IFERROR(VLOOKUP($B6,'2017 fell results'!$B$82:$D$93,3,FALSE),\"\")","v":""},{"$f":"IFERROR(VLOOKUP($B6,'2017 fell results'!$B$97:$D$108,3,FALSE),\"\")","v":""},{"$f":"IFERROR(VLOOKUP($B6,'2017 fell results'!$B$112:$D$123,3,FALSE),\"\")","v":""},{"$f":"IFERROR(VLOOKUP($B6,'2017 fell results'!$B$127:$D$138,3,FALSE),\"\")","v":""},95,95,4,25,25,23,22,"",4]
[{"$f":"RANK(M7,$M$5:$M$18,0)","v":3},"Dave Evans",{"$f":"VLOOKUP(B7,'Age Cat'!F:G,2,FALSE)","v":"V30"},{"$f":"IFERROR(VLOOKUP($B7,'2017 fell results'!$B$3:$D$14,3,FALSE),\"\")","v":""},{"$f":"IFERROR(VLOOKUP($B7,'2017 fell results'!$B$18:$D$29,3,FALSE),\"\")","v":21},{"$f":"IFERROR(VLOOKUP($B7,'2017 fell results'!$B$35:$D$52,3,FALSE),\"\")","v":23},{"$f":"IFERROR(VLOOKUP($B7,'2017 fell results'!$B$52:$D$63,3,FALSE),\"\")","v":24},{"$f":"IFERROR(VLOOKUP($B7,'2017 fell results'!$B$67:$D$78,3,FALSE),\"\")","v":""},{"$f":"IFERROR(VLOOKUP($B7,'2017 fell results'!$B$82:$D$93,3,FALSE),\"\")","v":""},{"$f":"IFERROR(VLOOKUP($B7,'2017 fell results'!$B$97:$D$108,3,FALSE),\"\")","v":""},{"$f":"IFERROR(VLOOKUP($B7,'2017 fell results'!$B$112:$D$123,3,FALSE),\"\")","v":""},{"$f":"IFERROR(VLOOKUP($B7,'2017 fell results'!$B$127:$D$138,3,FALSE),\"\")","v":""},68,68,3,24,23,21,"","",3]
[{"$f":"RANK(M8,$M$5:$M$18,0)","v":4},"Peter Lloyd",{"$f":"VLOOKUP(B8,'Age Cat'!F:G,2,FALSE)","v":"V30"},{"$f":"IFERROR(VLOOKUP($B8,'2017 fell results'!$B$3:$D$14,3,FALSE),\"\")","v":20},{"$f":"IFERROR(VLOOKUP($B8,'2017 fell results'!$B$18:$D$29,3,FALSE),\"\")","v":19},{"$f":"IFERROR(VLOOKUP($B8,'2017 fell results'!$B$35:$D$52,3,FALSE),\"\")","v":""},{"$f":"IFERROR(VLOOKUP($B8,'2017 fell results'!$B$52:$D$63,3,FALSE),\"\")","v":22},{"$f":"IFERROR(VLOOKUP($B8,'2017 fell results'!$B$67:$D$78,3,FALSE),\"\")","v":""},{"$f":"IFERROR(VLOOKUP($B8,'2017 fell results'!$B$82:$D$93,3,FALSE),\"\")","v":""},{"$f":"IFERROR(VLOOKUP($B8,'2017 fell results'!$B$97:$D$108,3,FALSE),\"\")","v":""},{"$f":"IFERROR(VLOOKUP($B8,'2017 fell results'!$B$112:$D$123,3,FALSE),\"\")","v":""},{"$f":"IFERROR(VLOOKUP($B8,'2017 fell results'!$B$127:$D$138,3,FALSE),\"\")","v":""},61,61,3,22,20,19,"","",3]
[{"$f":"RANK(M9,$M$5:$M$18,0)","v":5},"Richard Butter",{"$f":"VLOOKUP(B9,'Age Cat'!F:G,2,FALSE)","v":"V40"},{"$f":"IFERROR(VLOOKUP($B9,'2017 fell results'!$B$3:$D$14,3,FALSE),\"\")","v":19},{"$f":"IFERROR(VLOOKUP($B9,'2017 fell results'!$B$18:$D$29,3,FALSE),\"\")","v":18},{"$f":"IFERROR(VLOOKUP($B9,'2017 fell results'!$B$35:$D$52,3,FALSE),\"\")","v":20},{"$f":"IFERROR(VLOOKUP($B9,'2017 fell results'!$B$52:$D$63,3,FALSE),\"\")","v":""},{"$f":"IFERROR(VLOOKUP($B9,'2017 fell results'!$B$67:$D$78,3,FALSE),\"\")","v":""},{"$f":"IFERROR(VLOOKUP($B9,'2017 fell results'!$B$82:$D$93,3,FALSE),\"\")","v":""},{"$f":"IFERROR(VLOOKUP($B9,'2017 fell results'!$B$97:$D$108,3,FALSE),\"\")","v":""},{"$f":"IFERROR(VLOOKUP($B9,'2017 fell results'!$B$112:$D$123,3,FALSE),\"\")","v":""},{"$f":"IFERROR(VLOOKUP($B9,'2017 fell results'!$B$127:$D$138,3,FALSE),\"\")","v":""},57,57,3,20,19,18,"","",3]
[{"$f":"RANK(M10,$M$5:$M$18,0)","v":5},"Tim Thom",{"$f":"VLOOKUP(B10,'Age Cat'!F:G,2,FALSE)","v":"V50"},{"$f":"IFERROR(VLOOKUP($B10,'2017 fell results'!$B$3:$D$14,3,FALSE),\"\")","v":18},{"$f":"IFERROR(VLOOKUP($B10,'2017 fell results'!$B$18:$D$29,3,FALSE),\"\")","v":""},{"$f":"IFERROR(VLOOKUP($B10,'2017 fell results'!$B$35:$D$52,3,FALSE),\"\")","v":18},{"$f":"IFERROR(VLOOKUP($B10,'2017 fell results'!$B$52:$D$63,3,FALSE),\"\")","v":21},{"$f":"IFERROR(VLOOKUP($B10,'2017 fell results'!$B$67:$D$78,3,FALSE),\"\")","v":""},{"$f":"IFERROR(VLOOKUP($B10,'2017 fell results'!$B$82:$D$93,3,FALSE),\"\")","v":""},{"$f":"IFERROR(VLOOKUP($B10,'2017 fell results'!$B$97:$D$108,3,FALSE),\"\")","v":""},{"$f":"IFERROR(VLOOKUP($B10,'2017 fell results'!$B$112:$D$123,3,FALSE),\"\")","v":""},{"$f":"IFERROR(VLOOKUP($B10,'2017 fell results'!$B$127:$D$138,3,FALSE),\"\")","v":""},57,57,3,21,18,18,"","",3]
[{"$f":"RANK(M11,$M$5:$M$18,0)","v":7},"Richard Hindle",{"$f":"VLOOKUP(B11,'Age Cat'!F:G,2,FALSE)","v":"V60"},{"$f":"IFERROR(VLOOKUP($B11,'2017 fell results'!$B$3:$D$14,3,FALSE),\"\")","v":""},{"$f":"IFERROR(VLOOKUP($B11,'2017 fell results'!$B$18:$D$29,3,FALSE),\"\")","v":17},{"$f":"IFERROR(VLOOKUP($B11,'2017 fell results'!$B$35:$D$52,3,FALSE),\"\")","v":17},{"$f":"IFERROR(VLOOKUP($B11,'2017 fell results'!$B$52:$D$63,3,FALSE),\"\")","v":20},{"$f":"IFERROR(VLOOKUP($B11,'2017 fell results'!$B$67:$D$78,3,FALSE),\"\")","v":""},{"$f":"IFERROR(VLOOKUP($B11,'2017 fell results'!$B$82:$D$93,3,FALSE),\"\")","v":""},{"$f":"IFERROR(VLOOKUP($B11,'2017 fell results'!$B$97:$D$108,3,FALSE),\"\")","v":""},{"$f":"IFERROR(VLOOKUP($B11,'2017 fell results'!$B$112:$D$123,3,FALSE),\"\")","v":""},{"$f":"IFERROR(VLOOKUP($B11,'2017 fell results'!$B$127:$D$138,3,FALSE),\"\")","v":""},54,54,3,20,17,17,"","",3]
[{"$f":"RANK(M12,$M$5:$M$18,0)","v":8},"Ian Willis",{"$f":"VLOOKUP(B12,'Age Cat'!F:G,2,FALSE)","v":"V40"},{"$f":"IFERROR(VLOOKUP($B12,'2017 fell results'!$B$3:$D$14,3,FALSE),\"\")","v":24},{"$f":"IFERROR(VLOOKUP($B12,'2017 fell results'!$B$18:$D$29,3,FALSE),\"\")","v":25},{"$f":"IFERROR(VLOOKUP($B12,'2017 fell results'!$B$35:$D$52,3,FALSE),\"\")","v":""},{"$f":"IFERROR(VLOOKUP($B12,'2017 fell results'!$B$52:$D$63,3,FALSE),\"\")","v":""},{"$f":"IFERROR(VLOOKUP($B12,'2017 fell results'!$B$67:$D$78,3,FALSE),\"\")","v":""},{"$f":"IFERROR(VLOOKUP($B12,'2017 fell results'!$B$82:$D$93,3,FALSE),\"\")","v":""},{"$f":"IFERROR(VLOOKUP($B12,'2017 fell results'!$B$97:$D$108,3,FALSE),\"\")","v":""},{"$f":"IFERROR(VLOOKUP($B12,'2017 fell results'!$B$112:$D$123,3,FALSE),\"\")","v":""},{"$f":"IFERROR(VLOOKUP($B12,'2017 fell results'!$B$127:$D$138,3,FALSE),\"\")","v":""},49,49,2,25,24,"","","",2]
[{"$f":"RANK(M13,$M$5:$M$18,0)","v":9},"Alfie Walker",{"$f":"VLOOKUP(B13,'Age Cat'!F:G,2,FALSE)","v":"V40"},{"$f":"IFERROR(VLOOKUP($B13,'2017 fell results'!$B$3:$D$14,3,FALSE),\"\")","v":23},{"$f":"IFERROR(VLOOKUP($B13,'2017 fell results'!$B$18:$D$29,3,FALSE),\"\")","v":22},{"$f":"IFERROR(VLOOKUP($B13,'2017 fell results'!$B$35:$D$52,3,FALSE),\"\")","v":""},{"$f":"IFERROR(VLOOKUP($B13,'2017 fell results'!$B$52:$D$63,3,FALSE),\"\")","v":""},{"$f":"IFERROR(VLOOKUP($B13,'2017 fell results'!$B$67:$D$78,3,FALSE),\"\")","v":""},{"$f":"IFERROR(VLOOKUP($B13,'2017 fell results'!$B$82:$D$93,3,FALSE),\"\")","v":""},{"$f":"IFERROR(VLOOKUP($B13,'2017 fell results'!$B$97:$D$108,3,FALSE),\"\")","v":""},{"$f":"IFERROR(VLOOKUP($B13,'2017 fell results'!$B$112:$D$123,3,FALSE),\"\")","v":""},{"$f":"IFERROR(VLOOKUP($B13,'2017 fell results'!$B$127:$D$138,3,FALSE),\"\")","v":""},45,45,2,23,22,"","","",2]
[{"$f":"RANK(M14,$M$5:$M$18,0)","v":{"$error":"#VALUE!"}},"David Copping",{"$f":"VLOOKUP(B14,'Age Cat'!F:G,2,FALSE)","v":"V50"},{"$f":"IFERROR(VLOOKUP($B14,'2017 fell results'!$B$3:$D$14,3,FALSE),\"\")","v":""},{"$f":"IFERROR(VLOOKUP($B14,'2017 fell results'!$B$18:$D$29,3,FALSE),\"\")","v":""},{"$f":"IFERROR(VLOOKUP($B14,'2017 fell results'!$B$35:$D$52,3,FALSE),\"\")","v":""},{"$f":"IFERROR(VLOOKUP($B14,'2017 fell results'!$B$52:$D$63,3,FALSE),\"\")","v":""},{"$f":"IFERROR(VLOOKUP($B14,'2017 fell results'!$B$67:$D$78,3,FALSE),\"\")","v":""},{"$f":"IFERROR(VLOOKUP($B14,'2017 fell results'!$B$82:$D$93,3,FALSE),\"\")","v":""},{"$f":"IFERROR(VLOOKUP($B14,'2017 fell results'!$B$97:$D$108,3,FALSE),\"\")","v":""},{"$f":"IFERROR(VLOOKUP($B14,'2017 fell results'!$B$112:$D$123,3,FALSE),\"\")","v":""},{"$f":"IFERROR(VLOOKUP($B14,'2017 fell results'!$B$127:$D$138,3,FALSE),\"\")","v":""},"",0,"","","","","","",{"$f":"COUNT(P14:T14)","v":0}]
[{"$f":"RANK(M15,$M$5:$M$18,0)","v":10},"John Conroy",{"$f":"VLOOKUP(B15,'Age Cat'!F:G,2,FALSE)","v":"V40"},{"$f":"IFERROR(VLOOKUP($B15,'2017 fell results'!$B$3:$D$14,3,FALSE),\"\")","v":""},{"$f":"IFERROR(VLOOKUP($B15,'2017 fell results'!$B$18:$D$29,3,FALSE),\"\")","v":20},{"$f":"IFERROR(VLOOKUP($B15,'2017 fell results'!$B$35:$D$52,3,FALSE),\"\")","v":21},{"$f":"IFERROR(VLOOKUP($B15,'2017 fell results'!$B$52:$D$63,3,FALSE),\"\")","v":""},{"$f":"IFERROR(VLOOKUP($B15,'2017 fell results'!$B$67:$D$78,3,FALSE),\"\")","v":""},{"$f":"IFERROR(VLOOKUP($B15,'2017 fell results'!$B$82:$D$93,3,FALSE),\"\")","v":""},{"$f":"IFERROR(VLOOKUP($B15,'2017 fell results'!$B$97:$D$108,3,FALSE),\"\")","v":""},{"$f":"IFERROR(VLOOKUP($B15,'2017 fell results'!$B$112:$D$123,3,FALSE),\"\")","v":""},{"$f":"IFERROR(VLOOKUP($B15,'2017 fell results'!$B$127:$D$138,3,FALSE),\"\")","v":""},41,41,2,21,20,"","","",2]
[{"$f":"RANK(M16,$M$5:$M$18,0)","v":11},"Scott Bairstow",{"$f":"VLOOKUP(B16,'Age Cat'!F:G,2,FALSE)","v":"V40"},{"$f":"IFERROR(VLOOKUP($B16,'2017 fell results'!$B$3:$D$14,3,FALSE),\"\")","v":""},{"$f":"IFERROR(VLOOKUP($B16,'2017 fell results'!$B$18:$D$29,3,FALSE),\"\")","v":""},{"$f":"IFERROR(VLOOKUP($B16,'2017 fell results'!$B$35:$D$52,3,FALSE),\"\")","v":25},{"$f":"IFERROR(VLOOKUP($B16,'2017 fell results'!$B$52:$D$63,3,FALSE),\"\")","v":""},{"$f":"IFERROR(VLOOKUP($B16,'2017 fell results'!$B$67:$D$78,3,FALSE),\"\")","v":""},{"$f":"IFERROR(VLOOKUP($B16,'2017 fell results'!$B$82:$D$93,3,FALSE),\"\")","v":""},{"$f":"IFERROR(VLOOKUP($B16,'2017 fell results'!$B$97:$D$108,3,FALSE),\"\")","v":""},{"$f":"IFERROR(VLOOKUP($B16,'2017 fell results'!$B$112:$D$123,3,FALSE),\"\")","v":""},{"$f":"IFERROR(VLOOKUP($B16,'2017 fell results'!$B$127:$D$138,3,FALSE),\"\")","v":""},25,25,1,25,"","","","",1]
[{"$f":"RANK(M17,$M$5:$M$18,0)","v":12},"Simon Wheeler",{"$f":"VLOOKUP(B17,'Age Cat'!F:G,2,FALSE)","v":"V40"},{"$f":"IFERROR(VLOOKUP($B17,'2017 fell results'!$B$3:$D$14,3,FALSE),\"\")","v":""},{"$f":"IFERROR(VLOOKUP($B17,'2017 fell results'!$B$18:$D$29,3,FALSE),\"\")","v":""},{"$f":"IFERROR(VLOOKUP($B17,'2017 fell results'!$B$35:$D$52,3,FALSE),\"\")","v":19},{"$f":"IFERROR(VLOOKUP($B17,'2017 fell results'!$B$52:$D$63,3,FALSE),\"\")","v":""},{"$f":"IFERROR(VLOOKUP($B17,'2017 fell results'!$B$67:$D$78,3,FALSE),\"\")","v":""},{"$f":"IFERROR(VLOOKUP($B17,'2017 fell results'!$B$82:$D$93,3,FALSE),\"\")","v":""},{"$f":"IFERROR(VLOOKUP($B17,'2017 fell results'!$B$97:$D$108,3,FALSE),\"\")","v":""},{"$f":"IFERROR(VLOOKUP($B17,'2017 fell results'!$B$112:$D$123,3,FALSE),\"\")","v":""},{"$f":"IFERROR(VLOOKUP($B17,'2017 fell results'!$B$127:$D$138,3,FALSE),\"\")","v":""},19,19,{"$f":"IF(COUNT(D17:L17)=0,\"\",COUNT(D17:L17))","v":1},19,"","","","",1]
[{"$f":"RANK(M18,$M$5:$M$18,0)","v":13},"Paul Sessford",{"$f":"VLOOKUP(B18,'Age Cat'!F:G,2,FALSE)","v":"V50"},{"$f":"IFERROR(VLOOKUP($B18,'2017 fell results'!$B$3:$D$14,3,FALSE),\"\")","v":17},{"$f":"IFERROR(VLOOKUP($B18,'2017 fell results'!$B$18:$D$29,3,FALSE),\"\")","v":""},{"$f":"IFERROR(VLOOKUP($B18,'2017 fell results'!$B$35:$D$52,3,FALSE),\"\")","v":""},{"$f":"IFERROR(VLOOKUP($B18,'2017 fell results'!$B$52:$D$63,3,FALSE),\"\")","v":""},{"$f":"IFERROR(VLOOKUP($B18,'2017 fell results'!$B$67:$D$78,3,FALSE),\"\")","v":""},{"$f":"IFERROR(VLOOKUP($B18,'2017 fell results'!$B$82:$D$93,3,FALSE),\"\")","v":""},{"$f":"IFERROR(VLOOKUP($B18,'2017 fell results'!$B$97:$D$108,3,FALSE),\"\")","v":""},{"$f":"IFERROR(VLOOKUP($B18,'2017 fell results'!$B$112:$D$123,3,FALSE),\"\")","v":""},{"$f":"IFERROR(VLOOKUP($B18,'2017 fell results'!$B$127:$D$138,3,FALSE),\"\")","v":""},17,17,1,17,"","","","",1]
[null,null,null,null,null,null,null,null,null,null,null,null,null,null,null,null,null,null,null,null,0]
[null,null,null,null,null,null,null,null,null,null,null,null,null,null,null,null,null,null,null,null,0]
[null,null,null,null,null,null,null,null,null,null,null,null,null,null,null,null,null,null,null,null,0,null,null," "]
[null,null,null,null,null,null,null,null,null,null,null,null,null,null,null,null,null,null,null,null,0]
[null,null,null,null,null,null,null,null,null,null,null,null,null,null,null,null,null,null,null,null,0]
[null,null,null,null,null,null,null,null,null,null,null,null,null,null,null,null,null,null,null,null,0]
[null,null,null,null,null,null,null,null,null,null,null,null,null,null,null,null,null,null,null,null,0]
[null,null,null,null,null,null,null,null,null,null,null,null,null,null,null,null,null,null,null,null,0]
[null,null,null,null,null,null,null,null,null,null,null,null,null,null,null,null,null,null,null,null,0]
[null,null,null,null,null,null,null,null,null,null,null,null,null,null,null,null,null,null,null,null,0]
[]
["Pos","Name",null,{"$f":"D3","v":1},{"$f":"E3","v":2},3,4,5,6,7,8,9,"Total","Scoring Total","# Races","Top 5 Results"]
[null,null,null,{"$f":"VLOOKUP(D30,$A$40:$C$48,2,FALSE)","v":"2017-01-28"},"2017-02-18","2017-03-04","2017-04-08","2017-07-01","2017-09-02","2017-09-23","2017-12-09","2017-12-27",null,null,null,{"$f":"D30","v":1},2,3,4,5]
[1,"Tracey Hodgson",{"$f":"VLOOKUP(B32,'Age Cat'!F:G,2,FALSE)","v":"V30"},{"$f":"IFERROR(VLOOKUP($B32,'2017 fell results'!$B$3:$D$14,3,FALSE),\"\")","v":23},{"$f":"IFERROR(VLOOKUP($B32,'2017 fell results'!$B$18:$D$29,3,FALSE),\"\")","v":24},{"$f":"IFERROR(VLOOKUP($B32,'2017 fell results'!$B$35:$D$52,3,FALSE),\"\")","v":23},{"$f":"IFERROR(VLOOKUP($B32,'2017 fell results'!$B$52:$D$63,3,FALSE),\"\")","v":24},{"$f":"IFERROR(VLOOKUP($B32,'2017 fell results'!$B$67:$D$78,3,FALSE),\"\")","v":""},{"$f":"IFERROR(VLOOKUP($B32,'2017 fell results'!$B$82:$D$93,3,FALSE),\"\")","v":""},{"$f":"IFERROR(VLOOKUP($B32,'2017 fell results'!$B$97:$D$108,3,FALSE),\"\")","v":""},{"$f":"IFERROR(VLOOKUP($B32,'2017 fell results'!$B$112:$D$123,3,FALSE),\"\")","v":""},{"$f":"IFERROR(VLOOKUP($B32,'2017 fell results'!$B$127:$D$138,3,FALSE),\"\")","v":""},{"$f":"IF(SUM(D32:L32)=0,\"\",SUM(D32:L32))","v":94},{"$f":"SUM(P32:T32)","v":94},{"$f":"IF(COUNT(D32:L32)=0,\"\",COUNT(D32:L32))","v":4},{"$f":"IFERROR(LARGE($D32:$L32,D$3),\"\")","v":24},{"$f":"IFERROR(LARGE($D32:$L32,E$3),\"\")","v":24},23,23,"",{"$f":"COUNT(P32:T32)","v":4}]
[2,"Hannah Thom",{"$f":"VLOOKUP(B33,'Age Cat'!F:G,2,FALSE)","v":"S"},{"$f":"IFERROR(VLOOKUP($B33,'2017 fell results'!$B$3:$D$14,3,FALSE),\"\")","v":25},{"$f":"IFERROR(VLOOKUP($B33,'2017 fell results'!$B$18:$D$29,3,FALSE),\"\")","v":""},{"$f":"IFERROR(VLOOKUP($B33,'2017 fell results'!$B$35:$D$52,3,FALSE),\"\")","v":24},{"$f":"IFERROR(VLOOKUP($B33,'2017 fell results'!$B$52:$D$63,3,FALSE),\"\")","v":23},{"$f":"IFERROR(VLOOKUP($B33,'2017 fell results'!$B$67:$D$78,3,FALSE),\"\")","v":""},{"$f":"IFERROR(VLOOKUP($B33,'2017 fell results'!$B$82:$D$93,3,FALSE),\"\")","v":""},{"$f":"IFERROR(VLOOKUP($B33,'2017 fell results'!$B$97:$D$108,3,FALSE),\"\")","v":""},{"$f":"IFERROR(VLOOKUP($B33,'2017 fell results'!$B$112:$D$123,3,FALSE),\"\")","v":""},{"$f":"IFERROR(VLOOKUP($B33,'2017 fell results'!$B$127:$D$138,3,FALSE),\"\")","v":""},72,72,3,25,24,23,"","",3]
[3,"Hilary Barber",{"$f":"VLOOKUP(B34,'Age Cat'!F:G,2,FALSE)","v":"V50"},{"$f":"IFERROR(VLOOKUP($B34,'2017 fell results'!$B$3:$D$14,3,FALSE),\"\")","v":24},{"$f":"IFERROR(VLOOKUP($B34,'2017 fell results'!$B$18:$D$29,3,FALSE),\"\")","v":25},{"$f":"IFERROR(VLOOKUP($B34,'2017 fell results'!$B$35:$D$52,3,FALSE),\"\")","v":""},{"$f":"IFERROR(VLOOKUP($B34,'2017 fell results'!$B$52:$D$63,3,FALSE),\"\")","v":25},{"$f":"IFERROR(VLOOKUP($B34,'2017 fell results'!$B$67:$D$78,3,FALSE),\"\")","v":""},{"$f":"IFERROR(VLOOKUP($B34,'2017 fell results'!$B$82:$D$93,3,FALSE),\"\")","v":""},{"$f":"IFERROR(VLOOKUP($B34,'2017 fell results'!$B$97:$D$108,3,FALSE),\"\")","v":""},{"$f":"IFERROR(VLOOKUP($B34,'2017 fell results'!$B$112:$D$123,3,FALSE),\"\")","v":""},{"$f":"IFERROR(VLOOKUP($B34,'2017 fell results'!$B$127:$D$138,3,FALSE),\"\")","v":""},74,74,3,25,25,24,"","",3]
[4,"Lorna Hubbard",{"$f":"VLOOKUP(B35,'Age Cat'!F:G,2,FALSE)","v":"V30"},{"$f":"IFERROR(VLOOKUP($B35,'2017 fell results'!$B$3:$D$14,3,FALSE),\"\")","v":""},{"$f":"IFERROR(VLOOKUP($B35,'2017 fell results'!$B$18:$D$29,3,FALSE),\"\")","v":""},{"$f":"IFERROR(VLOOKUP($B35,'2017 fell results'!$B$35:$D$52,3,FALSE),\"\")","v":25},{"$f":"IFERROR(VLOOKUP($B35,'2017 fell results'!$B$52:$D$63,3,FALSE),\"\")","v":""},{"$f":"IFERROR(VLOOKUP($B35,'2017 fell results'!$B$67:$D$78,3,FALSE),\"\")","v":""},{"$f":"IFERROR(VLOOKUP($B35,'2017 fell results'!$B$82:$D$93,3,FALSE),\"\")","v":""},{"$f":"IFERROR(VLOOKUP($B35,'2017 fell results'!$B$97:$D$108,3,FALSE),\"\")","v":""},{"$f":"IFERROR(VLOOKUP($B35,'2017 fell results'!$B$112:$D$123,3,FALSE),\"\")","v":""},{"$f":"IFERROR(VLOOKUP($B35,'2017 fell results'!$B$127:$D$138,3,FALSE),\"\")","v":""},25,25,1,25,"","","","",{"$f":"IFERROR(LARGE($D35:$L35,I$3),\"\")","v":""}]
[5,"Emma Dooks",{"$f":"VLOOKUP(B36,'Age Cat'!F:G,2,FALSE)","v":"V50"},{"$f":"IFERROR(VLOOKUP($B36,'2017 fell results'!$B$3:$D$14,3,FALSE),\"\")","v":""},{"$f":"IFERROR(VLOOKUP($B36,'2017 fell results'!$B$18:$D$31,3,FALSE),\"\")","v":""},{"$f":"IFERROR(VLOOKUP($B36,'2017 fell results'!$B$35:$D$52,3,FALSE),\"\")","v":22},{"$f":"IFERROR(VLOOKUP($B36,'2017 fell results'!$B$52:$D$63,3,FALSE),\"\")","v":""},{"$f":"IFERROR(VLOOKUP($B36,'2017 fell results'!$B$67:$D$78,3,FALSE),\"\")","v":""},{"$f":"IFERROR(VLOOKUP($B36,'2017 fell results'!$B$82:$D$93,3,FALSE),\"\")","v":""},{"$f":"IFERROR(VLOOKUP($B36,'2017 fell results'!$B$97:$D$108,3,FALSE),\"\")","v":""},{"$f":"IFERROR(VLOOKUP($B36,'2017 fell results'!$B$112:$D$123,3,FALSE),\"\")","v":""},{"$f":"IFERROR(VLOOKUP($B36,'2017 fell results'!$B$127:$D$138,3,FALSE),\"\")","v":""},22,22,1,22,"","","","",{"$f":"IFERROR(LARGE($D36:$L36,I$3),\"\")","v":""}]
[6,"Diane MacDonald",{"$f":"VLOOKUP(B37,'Age Cat'!F:G,2,FALSE)","v":"V40"},{"$f":"IFERROR(VLOOKUP($B37,'2017 fell results'!$B$3:$D$14,3,FALSE),\"\")","v":""},{"$f":"IFERROR(VLOOKUP($B37,'2017 fell results'!$B$19:$D$31,3,FALSE),\"\")","v":""},{"$f":"IFERROR(VLOOKUP($B37,'2017 fell results'!$B$35:$D$52,3,FALSE),\"\")","v":21},{"$f":"IFERROR(VLOOKUP($B37,'2017 fell results'!$B$52:$D$63,3,FALSE),\"\")","v":""},{"$f":"IFERROR(VLOOKUP($B37,'2017 fell results'!$B$67:$D$78,3,FALSE),\"\")","v":""},{"$f":"IFERROR(VLOOKUP($B37,'2017 fell results'!$B$82:$D$93,3,FALSE),\"\")","v":""},{"$f":"IFERROR(VLOOKUP($B37,'2017 fell results'!$B$97:$D$108,3,FALSE),\"\")","v":""},{"$f":"IFERROR(VLOOKUP($B37,'2017 fell results'!$B$112:$D$123,3,FALSE),\"\")","v":""},{"$f":"IFERROR(VLOOKUP($B37,'2017 fell results'!$B$127:$D$138,3,FALSE),\"\")","v":""},21,21,1,21,"","","","",{"$f":"IFERROR(LARGE($D37:$L37,I$3),\"\")","v":""}]
[10,"Amanda Morrison","F",{"$f":"IFERROR(VLOOKUP($B38,'2017 fell results'!$B$3:$D$14,3,FALSE),\"\")","v":""},{"$f":"IFERROR(VLOOKUP($B38,'2017 fell results'!$B$18:$D$31,3,FALSE),\"\")","v":""},{"$f":"IFERROR(VLOOKUP($B38,'2017 fell results'!$B$35:$D$52,3,FALSE),\"\")","v":""},{"$f":"IFERROR(VLOOKUP($B38,'2017 fell results'!$B$52:$D$63,3,FALSE),\"\")","v":""},{"$f":"IFERROR(VLOOKUP($B38,'2017 fell results'!$B$67:$D$78,3,FALSE),\"\")","v":""},{"$f":"IFERROR(VLOOKUP($B38,'2017 fell results'!$B$82:$D$93,3,FALSE),\"\")","v":""},{"$f":"IFERROR(VLOOKUP($B38,'2017 fell results'!$B$97:$D$108,3,FALSE),\"\")","v":""},{"$f":"IFERROR(VLOOKUP($B38,'2017 fell results'!$B$112:$D$123,3,FALSE),\"\")","v":""},{"$f":"IFERROR(VLOOKUP($B38,'2017 fell results'!$B$127:$D$138,3,FALSE),\"\")","v":""},{"$f":"IF(SUM(D38:L38)=0,\"\",SUM(D38:L38))","v":""},{"$f":"SUM(P38:T38)","v":0},"","",null,null,{"$f":"IFERROR(LARGE($D38:$L38,I$3),\"\")","v":""},{"$f":"IFERROR(LARGE($D38:$L38,J$3),\"\")","v":""},0]
[]
[1,"2017-01-28","Hoofstones"]
[2,"2017-02-18","Bleasdale Circle"]
[3,"2017-03-04","Stan Bradshaw Pendle Round"]
[4,"2017-04-08","Coledale Horseshoe"]
[5,"2017-07-01","Oakworth Haul"]
[6,"2017-09-02","Grisedale Horseshoe"]
[7,"2017-09-23","Great Whernside"]
[8,"2017-12-09","Mytholmroyd"]
[9,"2017-12-27","Guisborough Wood"]

{"sheet":"2017 xc Table","index":4,"n_rows":45,"n_cols":21,"rows_kept":45,"cut":false,"hidden":false,"merged":[[37,3,37,9],[37,10,37,12],[46,1,46,11],[2,13,2,16],[28,0,29,0],[28,1,29,1],[28,10,29,10],[28,11,29,11],[28,12,29,12],[28,13,28,16],[2,12,3,12],[0,0,1,1],[2,0,3,0],[2,1,3,1],[2,10,3,10],[2,11,3,11]]}
["2017 - xc\n(Best 4 of 7 Races)"]
[null,null,null,{"$f":"VLOOKUP(D3,$A$39:$C$45,3,FALSE)","v":"Yorkshire Champs"},"National Champs","Open Kross Challenge","1st WYXC Race","2nd WYXC Race","3rd WYXC Race","4th WYXC Race"]
["Pos","Name",null,1,2,3,4,5,6,7,"Total","Scoring Total","# Races","Top 4 Results"]
[null,null,null,{"$f":"VLOOKUP(D3,$A$39:$C$45,2,FALSE)","v":"Jan"},{"$f":"VLOOKUP(E3,$A$39:$C$45,2,FALSE)","v":"Feb"},null,{"$f":"VLOOKUP(G3,$A$39:$C$45,2,FALSE)","v":"Oct"},{"$f":"VLOOKUP(H3,$A$39:$C$45,2,FALSE)","v":"Oct"},{"$f":"VLOOKUP(I3,$A$39:$C$45,2,FALSE)","v":"Nov"},{"$f":"VLOOKUP(J3,$A$39:$C$45,2,FALSE)","v":"Dec"},null,null,null,{"$f":"D3","v":1},2,3,4]
[1,"Scott Bairstow",{"$f":"VLOOKUP(B5,'Age Cat'!F:G,2,FALSE)","v":"V40"},{"$f":"IFERROR(VLOOKUP($B5,'2017 xc results'!$B$3:$D$13,3,FALSE),\"\")","v":24},{"$f":"IFERROR(VLOOKUP($B5,'2017 xc results'!$B$17:$D$28,3,FALSE),\"\")","v":25},{"$f":"IFERROR(VLOOKUP($B5,'2017 xc results'!$B$34:$D$50,3,FALSE),\"\")","v":""},{"$f":"IFERROR(VLOOKUP($B5,'2017 xc results'!$B$50:$D$61,3,FALSE),\"\")","v":""},{"$f":"IFERROR(VLOOKUP($B5,'2017 xc results'!$B$65:$D$76,3,FALSE),\"\")","v":""},{"$f":"IFERROR(VLOOKUP($B5,'2017 xc results'!$B$80:$D$91,3,FALSE),\"\")","v":""},{"$f":"IFERROR(VLOOKUP($B5,'2017 xc results'!$B$95:$D$106,3,FALSE),\"\")","v":""},{"$f":"IF(SUM(D5:J5)=0,\"\",SUM(D5:J5))","v":49},{"$f":"SUM(N5:Q5)","v":49},{"$f":"IF(COUNT(D5:J5)=0,\"\",COUNT(D5:J5))","v":2},{"$f":"IFERROR(LARGE($D5:$J5,D$3),\"\")","v":25},{"$f":"IFERROR(LARGE($D5:$J5,E$3),\"\")","v":24},{"$f":"IFERROR(LARGE($D5:$J5,F$3),\"\")","v":""},{"$f":"IFERROR(LARGE($D5:$J5,H$3),\"\")","v":""},{"$f":"COUNT(N5:Q5)","v":2}]
[{"$f":"A5+1","v":2},"John Conroy",{"$f":"VLOOKUP(B6,'Age Cat'!F:G,2,FALSE)","v":"V40"},{"$f":"IFERROR(VLOOKUP($B6,'2017 xc results'!$B$3:$D$13,3,FALSE),\"\")","v":23},{"$f":"IFERROR(VLOOKUP($B6,'2017 xc results'!$B$17:$D$28,3,FALSE),\"\")","v":24},{"$f":"IFERROR(VLOOKUP($B6,'2017 xc results'!$B$34:$D$50,3,FALSE),\"\")","v":""},{"$f":"IFERROR(VLOOKUP($B6,'2017 xc results'!$B$50:$D$61,3,FALSE),\"\")","v":""},{"$f":"IFERROR(VLOOKUP($B6,'2017 xc results'!$B$65:$D$76,3,FALSE),\"\")","v":""},{"$f":"IFERROR(VLOOKUP($B6,'2017 xc results'!$B$80:$D$91,3,FALSE),\"\")","v":""},{"$f":"IFERROR(VLOOKUP($B6,'2017 xc results'!$B$95:$D$106,3,FALSE),\"\")","v":""},47,47,2,24,23,"","",2]
[3,"Ian Willis",{"$f":"VLOOKUP(B7,'Age Cat'!F:G,2,FALSE)","v":"V40"},{"$f":"IFERROR(VLOOKUP($B7,'2017 xc results'!$B$3:$D$13,3,FALSE),\"\")","v":25},{"$f":"IFERROR(VLOOKUP($B7,'2017 xc results'!$B$17:$D$28,3,FALSE),\"\")","v":""},{"$f":"IFERROR(VLOOKUP($B7,'2017 xc results'!$B$34:$D$50,3,FALSE),\"\")","v":""},{"$f":"IFERROR(VLOOKUP($B7,'2017 xc results'!$B$50:$D$61,3,FALSE),\"\")","v":""},{"$f":"IFERROR(VLOOKUP($B7,'2017 xc results'!$B$65:$D$76,3,FALSE),\"\")","v":""},{"$f":"IFERROR(VLOOKUP($B7,'2017 xc results'!$B$80:$D$91,3,FALSE),\"\")","v":""},{"$f":"IFERROR(VLOOKUP($B7,'2017 xc results'!$B$95:$D$106,3,FALSE),\"\")","v":""},25,25,1,25,"","","",1]
[4,null,null,{"$f":"IFERROR(VLOOKUP($B8,'2017 xc results'!$B$3:$D$13,3,FALSE),\"\")","v":""},{"$f":"IFERROR(VLOOKUP($B8,'2017 xc results'!$B$17:$D$28,3,FALSE),\"\")","v":""},{"$f":"IFERROR(VLOOKUP($B8,'2017 xc results'!$B$34:$D$50,3,FALSE),\"\")","v":""},{"$f":"IFERROR(VLOOKUP($B8,'2017 xc results'!$B$50:$D$61,3,FALSE),\"\")","v":""},{"$f":"IFERROR(VLOOKUP($B8,'2017 xc results'!$B$65:$D$76,3,FALSE),\"\")","v":""},{"$f":"IFERROR(VLOOKUP($B8,'2017 xc results'!$B$80:$D$91,3,FALSE),\"\")","v":""},{"$f":"IFERROR(VLOOKUP($B8,'2017 xc results'!$B$95:$D$106,3,FALSE),\"\")","v":""},"",0,"","","","","",0]
[5,null,null,{"$f":"IFERROR(VLOOKUP($B9,'2017 xc results'!$B$3:$D$13,3,FALSE),\"\")","v":""},{"$f":"IFERROR(VLOOKUP($B9,'2017 xc results'!$B$17:$D$28,3,FALSE),\"\")","v":""},{"$f":"IFERROR(VLOOKUP($B9,'2017 xc results'!$B$34:$D$50,3,FALSE),\"\")","v":""},{"$f":"IFERROR(VLOOKUP($B9,'2017 xc results'!$B$50:$D$61,3,FALSE),\"\")","v":""},{"$f":"IFERROR(VLOOKUP($B9,'2017 xc results'!$B$65:$D$76,3,FALSE),\"\")","v":""},{"$f":"IFERROR(VLOOKUP($B9,'2017 xc results'!$B$80:$D$91,3,FALSE),\"\")","v":""},{"$f":"IFERROR(VLOOKUP($B9,'2017 xc results'!$B$95:$D$106,3,FALSE),\"\")","v":""},"",0,"","","","","",0]
[6,null,null,{"$f":"IFERROR(VLOOKUP($B10,'2017 xc results'!$B$3:$D$13,3,FALSE),\"\")","v":""},{"$f":"IFERROR(VLOOKUP($B10,'2017 xc results'!$B$17:$D$28,3,FALSE),\"\")","v":""},{"$f":"IFERROR(VLOOKUP($B10,'2017 xc results'!$B$34:$D$50,3,FALSE),\"\")","v":""},{"$f":"IFERROR(VLOOKUP($B10,'2017 xc results'!$B$50:$D$61,3,FALSE),\"\")","v":""},{"$f":"IFERROR(VLOOKUP($B10,'2017 xc results'!$B$65:$D$76,3,FALSE),\"\")","v":""},{"$f":"IFERROR(VLOOKUP($B10,'2017 xc results'!$B$80:$D$91,3,FALSE),\"\")","v":""},{"$f":"IFERROR(VLOOKUP($B10,'2017 xc results'!$B$95:$D$106,3,FALSE),\"\")","v":""},"",0,"","","","","",0]
[7,null,null,{"$f":"IFERROR(VLOOKUP($B11,'2017 xc results'!$B$3:$D$13,3,FALSE),\"\")","v":""},{"$f":"IFERROR(VLOOKUP($B11,'2017 xc results'!$B$17:$D$28,3,FALSE),\"\")","v":""},{"$f":"IFERROR(VLOOKUP($B11,'2017 xc results'!$B$34:$D$50,3,FALSE),\"\")","v":""},{"$f":"IFERROR(VLOOKUP($B11,'2017 xc results'!$B$50:$D$61,3,FALSE),\"\")","v":""},{"$f":"IFERROR(VLOOKUP($B11,'2017 xc results'!$B$65:$D$76,3,FALSE),\"\")","v":""},{"$f":"IFERROR(VLOOKUP($B11,'2017 xc results'!$B$80:$D$91,3,FALSE),\"\")","v":""},{"$f":"IFERROR(VLOOKUP($B11,'2017 xc results'!$B$95:$D$106,3,FALSE),\"\")","v":""},"",0,"","","","","",0]
[8,null,null,{"$f":"IFERROR(VLOOKUP($B12,'2017 xc results'!$B$3:$D$13,3,FALSE),\"\")","v":""},{"$f":"IFERROR(VLOOKUP($B12,'2017 xc results'!$B$17:$D$28,3,FALSE),\"\")","v":""},{"$f":"IFERROR(VLOOKUP($B12,'2017 xc results'!$B$34:$D$50,3,FALSE),\"\")","v":""},{"$f":"IFERROR(VLOOKUP($B12,'2017 xc results'!$B$50:$D$61,3,FALSE),\"\")","v":""},{"$f":"IFERROR(VLOOKUP($B12,'2017 xc results'!$B$65:$D$76,3,FALSE),\"\")","v":""},{"$f":"IFERROR(VLOOKUP($B12,'2017 xc results'!$B$80:$D$91,3,FALSE),\"\")","v":""},{"$f":"IFERROR(VLOOKUP($B12,'2017 xc results'!$B$95:$D$106,3,FALSE),\"\")","v":""},"",0,"","","","","",0]
[9,null,null,{"$f":"IFERROR(VLOOKUP($B13,'2017 xc results'!$B$3:$D$13,3,FALSE),\"\")","v":""},{"$f":"IFERROR(VLOOKUP($B13,'2017 xc results'!$B$17:$D$28,3,FALSE),\"\")","v":""},{"$f":"IFERROR(VLOOKUP($B13,'2017 xc results'!$B$34:$D$50,3,FALSE),\"\")","v":""},{"$f":"IFERROR(VLOOKUP($B13,'2017 xc results'!$B$50:$D$61,3,FALSE),\"\")","v":""},{"$f":"IFERROR(VLOOKUP($B13,'2017 xc results'!$B$65:$D$76,3,FALSE),\"\")","v":""},{"$f":"IFERROR(VLOOKUP($B13,'2017 xc results'!$B$80:$D$91,3,FALSE),\"\")","v":""},{"$f":"IFERROR(VLOOKUP($B13,'2017 xc results'!$B$95:$D$106,3,FALSE),\"\")","v":""},"",0,"","","","","",0]
[10,null,null,{"$f":"IFERROR(VLOOKUP($B14,'2017 xc results'!$B$3:$D$13,3,FALSE),\"\")","v":""},{"$f":"IFERROR(VLOOKUP($B14,'2017 xc results'!$B$17:$D$28,3,FALSE),\"\")","v":""},{"$f":"IFERROR(VLOOKUP($B14,'2017 xc results'!$B$34:$D$50,3,FALSE),\"\")","v":""},{"$f":"IFERROR(VLOOKUP($B14,'2017 xc results'!$B$50:$D$61,3,FALSE),\"\")","v":""},{"$f":"IFERROR(VLOOKUP($B14,'2017 xc results'!$B$65:$D$76,3,FALSE),\"\")","v":""},{"$f":"IFERROR(VLOOKUP($B14,'2017 xc results'!$B$80:$D$91,3,FALSE),\"\")","v":""},{"$f":"IFERROR(VLOOKUP($B14,'2017 xc results'!$B$95:$D$106,3,FALSE),\"\")","v":""},"",0,"","","","","",0]
[11,null,null,{"$f":"IFERROR(VLOOKUP($B15,'2017 xc results'!$B$3:$D$13,3,FALSE),\"\")","v":""},{"$f":"IFERROR(VLOOKUP($B15,'2017 xc results'!$B$17:$D$28,3,FALSE),\"\")","v":""},{"$f":"IFERROR(VLOOKUP($B15,'2017 xc results'!$B$34:$D$50,3,FALSE),\"\")","v":""},{"$f":"IFERROR(VLOOKUP($B15,'2017 xc results'!$B$50:$D$61,3,FALSE),\"\")","v":""},{"$f":"IFERROR(VLOOKUP($B15,'2017 xc results'!$B$65:$D$76,3,FALSE),\"\")","v":""},{"$f":"IFERROR(VLOOKUP($B15,'2017 xc results'!$B$80:$D$91,3,FALSE),\"\")","v":""},{"$f":"IFERROR(VLOOKUP($B15,'2017 xc results'!$B$95:$D$106,3,FALSE),\"\")","v":""},"",0,"","","","","",0]
[12,null,null,{"$f":"IFERROR(VLOOKUP($B16,'2017 xc results'!$B$3:$D$13,3,FALSE),\"\")","v":""},{"$f":"IFERROR(VLOOKUP($B16,'2017 xc results'!$B$17:$D$28,3,FALSE),\"\")","v":""},{"$f":"IFERROR(VLOOKUP($B16,'2017 xc results'!$B$34:$D$50,3,FALSE),\"\")","v":""},{"$f":"IFERROR(VLOOKUP($B16,'2017 xc results'!$B$50:$D$61,3,FALSE),\"\")","v":""},{"$f":"IFERROR(VLOOKUP($B16,'2017 xc results'!$B$65:$D$76,3,FALSE),\"\")","v":""},{"$f":"IFERROR(VLOOKUP($B16,'2017 xc results'!$B$80:$D$91,3,FALSE),\"\")","v":""},{"$f":"IFERROR(VLOOKUP($B16,'2017 xc results'!$B$95:$D$106,3,FALSE),\"\")","v":""},"",0,"","","","","",0]
[14,null,null,{"$f":"IFERROR(VLOOKUP($B17,'2017 xc results'!$B$3:$D$13,3,FALSE),\"\")","v":""},{"$f":"IFERROR(VLOOKUP($B17,'2017 xc results'!$B$17:$D$28,3,FALSE),\"\")","v":""},{"$f":"IFERROR(VLOOKUP($B17,'2017 xc results'!$B$34:$D$50,3,FALSE),\"\")","v":""},{"$f":"IFERROR(VLOOKUP($B17,'2017 xc results'!$B$50:$D$61,3,FALSE),\"\")","v":""},{"$f":"IFERROR(VLOOKUP($B17,'2017 xc results'!$B$65:$D$76,3,FALSE),\"\")","v":""},{"$f":"IFERROR(VLOOKUP($B17,'2017 xc results'!$B$80:$D$91,3,FALSE),\"\")","v":""},{"$f":"IFERROR(VLOOKUP($B17,'2017 xc results'!$B$95:$D$106,3,FALSE),\"\")","v":""},"",0,"","","","","",0]
[null,null,null,null,null,null,null,null,null,null,null,null,null,null,null,null,null,0]
[null,null,null,null,null,null,null,null,null,null,null,null,null,null,null,null,null,0]
[null,null,null,null,null,null,null,null,null,null,null,null,null,null,null,null,null,0,null,null," "]
[null,null,null,null,null,null,null,null,null,null,null,null,null,null,null,null,null,0]
[null,null,null,null,null,null,null,null,null,null,null,null,null,null,null,null,null,0]
[null,null,null,null,null,null,null,null,null,null,null,null,null,null,null,null,null,0]
[null,null,null,null,null,null,null,null,null,null,null,null,null,null,null,null,null,0]
[null,null,null,null,null,null,null,null,null,null,null,null,null,null,null,null,null,0]
[null,null,null,null,null,null,null,null,null,null,null,null,null,null,null,null,null,0]
[null,null,null,null,null,null,null,null,null,null,null,null,null,null,null,null,null,0]
[]
["Pos","Name",null,{"$f":"D3","v":1},2,3,4,5,6,7,"Total","Scoring Total","# Races","Top 4 Results"]
[null,null,null,{"$f":"VLOOKUP(D29,$A$39:$C$45,2,FALSE)","v":"Jan"},"Feb","00:00:00","Oct","Oct","Nov","Dec",null,null,null,{"$f":"D29","v":1},2,3,4]
[1,"Tizz Woffenden",{"$f":"VLOOKUP(B31,'Age Cat'!F:G,2,FALSE)","v":"V40"},{"$f":"IFERROR(VLOOKUP($B31,'2017 xc results'!$B$3:$D$13,3,FALSE),\"\")","v":25},{"$f":"IFERROR(VLOOKUP($B31,'2017 xc results'!$B$17:$D$28,3,FALSE),\"\")","v":""},{"$f":"IFERROR(VLOOKUP($B31,'2017 xc results'!$B$34:$D$50,3,FALSE),\"\")","v":""},{"$f":"IFERROR(VLOOKUP($B31,'2017 xc results'!$B$50:$D$61,3,FALSE),\"\")","v":""},{"$f":"IFERROR(VLOOKUP($B31,'2017 xc results'!$B$65:$D$76,3,FALSE),\"\")","v":""},{"$f":"IFERROR(VLOOKUP($B31,'2017 xc results'!$B$80:$D$91,3,FALSE),\"\")","v":""},{"$f":"IFERROR(VLOOKUP($B31,'2017 xc results'!$B$95:$D$106,3,FALSE),\"\")","v":""},{"$f":"IF(SUM(D31:J31)=0,\"\",SUM(D31:J31))","v":25},{"$f":"SUM(N31:Q31)","v":25},{"$f":"IF(COUNT(D31:J31)=0,\"\",COUNT(D31:J31))","v":1},{"$f":"IFERROR(LARGE($D31:$J31,D$3),\"\")","v":25},"","",{"$f":"IFERROR(LARGE($D31:$J31,H$3),\"\")","v":""},{"$f":"COUNT(N31:Q31)","v":1}]
[2,"Claire Cooper",{"$f":"VLOOKUP(B32,'Age Cat'!F:G,2,FALSE)","v":"V30"},{"$f":"IFERROR(VLOOKUP($B32,'2017 xc results'!$B$3:$D$13,3,FALSE),\"\")","v":24},{"$f":"IFERROR(VLOOKUP($B32,'2017 xc results'!$B$17:$D$28,3,FALSE),\"\")","v":""},{"$f":"IFERROR(VLOOKUP($B32,'2017 xc results'!$B$34:$D$50,3,FALSE),\"\")","v":""},{"$f":"IFERROR(VLOOKUP($B32,'2017 xc results'!$B$50:$D$61,3,FALSE),\"\")","v":""},{"$f":"IFERROR(VLOOKUP($B32,'2017 xc results'!$B$65:$D$76,3,FALSE),\"\")","v":""},{"$f":"IFERROR(VLOOKUP($B32,'2017 xc results'!$B$80:$D$91,3,FALSE),\"\")","v":""},{"$f":"IFERROR(VLOOKUP($B32,'2017 xc results'!$B$95:$D$106,3,FALSE),\"\")","v":""},24,24,1,24,"","","",{"$f":"COUNT(N32:Q32)","v":1}]
[3,"Sarah O'Sullivan",{"$f":"VLOOKUP(B33,'Age Cat'!F:G,2,FALSE)","v":"V40"},{"$f":"IFERROR(VLOOKUP($B33,'2017 xc results'!$B$3:$D$13,3,FALSE),\"\")","v":23},{"$f":"IFERROR(VLOOKUP($B33,'2017 xc results'!$B$17:$D$28,3,FALSE),\"\")","v":""},{"$f":"IFERROR(VLOOKUP($B33,'2017 xc results'!$B$34:$D$50,3,FALSE),\"\")","v":""},{"$f":"IFERROR(VLOOKUP($B33,'2017 xc results'!$B$50:$D$61,3,FALSE),\"\")","v":""},{"$f":"IFERROR(VLOOKUP($B33,'2017 xc results'!$B$65:$D$76,3,FALSE),\"\")","v":""},{"$f":"IFERROR(VLOOKUP($B33,'2017 xc results'!$B$80:$D$91,3,FALSE),\"\")","v":""},{"$f":"IFERROR(VLOOKUP($B33,'2017 xc results'!$B$95:$D$106,3,FALSE),\"\")","v":""},23,23,1,23,"","","",{"$f":"COUNT(N33:Q33)","v":1}]
[4,"Angela Paxton",{"$f":"VLOOKUP(B34,'Age Cat'!F:G,2,FALSE)","v":"V50"},{"$f":"IFERROR(VLOOKUP($B34,'2017 xc results'!$B$3:$D$13,3,FALSE),\"\")","v":22},{"$f":"IFERROR(VLOOKUP($B34,'2017 xc results'!$B$17:$D$28,3,FALSE),\"\")","v":""},{"$f":"IFERROR(VLOOKUP($B34,'2017 xc results'!$B$34:$D$50,3,FALSE),\"\")","v":""},{"$f":"IFERROR(VLOOKUP($B34,'2017 xc results'!$B$50:$D$61,3,FALSE),\"\")","v":""},{"$f":"IFERROR(VLOOKUP($B34,'2017 xc results'!$B$65:$D$76,3,FALSE),\"\")","v":""},{"$f":"IFERROR(VLOOKUP($B34,'2017 xc results'!$B$80:$D$91,3,FALSE),\"\")","v":""},{"$f":"IFERROR(VLOOKUP($B34,'2017 xc results'!$B$95:$D$106,3,FALSE),\"\")","v":""},22,22,1,22,"","","",{"$f":"IFERROR(LARGE($D34:$J34,I$3),\"\")","v":""}]
[5,"Camille Askins",{"$f":"VLOOKUP(B35,'Age Cat'!F:G,2,FALSE)","v":"V40"},{"$f":"IFERROR(VLOOKUP($B35,'2017 xc results'!$B$3:$D$13,3,FALSE),\"\")","v":21},{"$f":"IFERROR(VLOOKUP($B35,'2017 xc results'!$B$17:$D$30,3,FALSE),\"\")","v":""},{"$f":"IFERROR(VLOOKUP($B35,'2017 xc results'!$B$34:$D$50,3,FALSE),\"\")","v":""},{"$f":"IFERROR(VLOOKUP($B35,'2017 xc results'!$B$50:$D$61,3,FALSE),\"\")","v":""},{"$f":"IFERROR(VLOOKUP($B35,'2017 xc results'!$B$65:$D$76,3,FALSE),\"\")","v":""},{"$f":"IFERROR(VLOOKUP($B35,'2017 xc results'!$B$80:$D$91,3,FALSE),\"\")","v":""},{"$f":"IFERROR(VLOOKUP($B35,'2017 xc results'!$B$95:$D$106,3,FALSE),\"\")","v":""},21,21,1,21,"","","",{"$f":"IFERROR(LARGE($D35:$J35,I$3),\"\")","v":""}]
[6,null,"F",{"$f":"IFERROR(VLOOKUP($B36,'2017 xc results'!$B$3:$D$13,3,FALSE),\"\")","v":""},{"$f":"IFERROR(VLOOKUP($B36,'2017 xc results'!$B$18:$D$30,3,FALSE),\"\")","v":""},{"$f":"IFERROR(VLOOKUP($B36,'2017 xc results'!$B$34:$D$50,3,FALSE),\"\")","v":""},{"$f":"IFERROR(VLOOKUP($B36,'2017 xc results'!$B$50:$D$61,3,FALSE),\"\")","v":""},{"$f":"IFERROR(VLOOKUP($B36,'2017 xc results'!$B$65:$D$76,3,FALSE),\"\")","v":""},{"$f":"IFERROR(VLOOKUP($B36,'2017 xc results'!$B$80:$D$91,3,FALSE),\"\")","v":""},{"$f":"IFERROR(VLOOKUP($B36,'2017 xc results'!$B$95:$D$106,3,FALSE),\"\")","v":""},"",0,"","","","","",{"$f":"IFERROR(LARGE($D36:$J36,I$3),\"\")","v":""}]
[10,"Amanda Morrison","F",{"$f":"IFERROR(VLOOKUP($B37,'2017 xc results'!$B$3:$D$13,3,FALSE),\"\")","v":""},{"$f":"IFERROR(VLOOKUP($B37,'2017 xc results'!$B$17:$D$30,3,FALSE),\"\")","v":""},{"$f":"IFERROR(VLOOKUP($B37,'2017 xc results'!$B$34:$D$50,3,FALSE),\"\")","v":""},{"$f":"IFERROR(VLOOKUP($B37,'2017 xc results'!$B$50:$D$61,3,FALSE),\"\")","v":""},{"$f":"IFERROR(VLOOKUP($B37,'2017 xc results'!$B$65:$D$76,3,FALSE),\"\")","v":""},{"$f":"IFERROR(VLOOKUP($B37,'2017 xc results'!$B$80:$D$91,3,FALSE),\"\")","v":""},{"$f":"IFERROR(VLOOKUP($B37,'2017 xc results'!$B$95:$D$106,3,FALSE),\"\")","v":""},"",{"$f":"SUM(N37:Q37)","v":0},"",{"$f":"IFERROR(LARGE($D37:$J37,D$3),\"\")","v":""},null,null,{"$f":"IFERROR(LARGE($D37:$J37,J$3),\"\")","v":""},{"$f":"COUNT(N37:Q37)","v":0}]
[]
[1,"Jan","Yorkshire Champs"]
[2,"Feb","National Champs"]
[3,null,"Open Kross Challenge"]
[4,"Oct","1st WYXC Race"]
[5,"Oct","2nd WYXC Race"]
[6,"Nov","3rd WYXC Race"]
[7,"Dec","4th WYXC Race"]

{"sheet":"2017 Road Table","index":5,"n_rows":68,"n_cols":24,"rows_kept":68,"cut":false,"hidden":false,"merged":[[58,3,58,11],[58,12,58,14],[69,1,69,13],[2,15,2,19],[36,0,37,0],[36,1,37,1],[36,12,37,12],[36,13,37,13],[36,14,37,14],[36,15,36,19],[2,14,3,14],[0,0,1,1],[2,0,3,0],[2,1,3,1],[2,12,3,12],[2,13,3,13]]}
["2017 - Road\n(Best 5 of 9 Races)"]
[null,null,null,{"$f":"VLOOKUP(D3,$A$60:$C$68,3,FALSE)","v":"Bradford 10k"},"Esholt 5k Series (x3)","Bronte 5m","Helen Windsor 10K ","UAK Track 1M ","Burnsall 10M ","Holmfirth 10K ","Best ½ Marathon ","Best Marathon "]
["Pos","Name",null,1,2,3,4,5,6,7,8,9,"Total","Scoring Total","# Races","Top 5 Results"]
[null,null,null,{"$f":"VLOOKUP(D3,$A$60:$C$68,2,FALSE)","v":"2017-03-19"},"May","2017-06-08","2017-07-05","2017-08-03","2017-08-19","2017-10-29",null,null,null,null,null,{"$f":"D3","v":1},2,3,4,5]
[{"$f":"RANK(N5,$N$5:$N$35,0)","v":1},"Craig Cooper",{"$f":"VLOOKUP(B5,'Age Cat'!F:G,2,FALSE)","v":"V40"},{"$f":"IFERROR(VLOOKUP($B5,'2017 Road results'!$B$3:$D$22,3,FALSE),\"\")","v":25},null,null,null,null,null,null,{"$f":"IFERROR(VLOOKUP($B5,'2017 marathon & half'!$B$3:$D$14,3,FALSE),\"\")","v":""},{"$f":"IFERROR(VLOOKUP($B5,'2017 marathon & half'!$B$27:$D$42,3,FALSE),\"\")","v":23},{"$f":"IF(SUM(D5:L5)=0,\"\",SUM(D5:L5))","v":48},{"$f":"SUM(P5:T5)","v":48},{"$f":"IF(COUNT(D5:L5)=0,\"\",COUNT(D5:L5))","v":2},{"$f":"IFERROR(LARGE($D5:$L5,D$3),\"\")","v":25},{"$f":"IFERROR(LARGE($D5:$L5,E$3),\"\")","v":23},"","","",{"$f":"COUNT(P5:T5)","v":2}]
[{"$f":"RANK(N6,$N$5:$N$35,0)","v":1},"Tony Booth",{"$f":"VLOOKUP(B6,'Age Cat'!F:G,2,FALSE)","v":"V40"},{"$f":"IFERROR(VLOOKUP($B6,'2017 Road results'!$B$3:$D$22,3,FALSE),\"\")","v":""},null,null,null,null,null,null,{"$f":"IFERROR(VLOOKUP($B6,'2017 marathon & half'!$B$3:$D$14,3,FALSE),\"\")","v":24},{"$f":"IFERROR(VLOOKUP($B6,'2017 marathon & half'!$B$27:$D$42,3,FALSE),\"\")","v":24},48,{"$f":"SUM(P6:T6)","v":48},{"$f":"IF(COUNT(D6:L6)=0,\"\",COUNT(D6:L6))","v":2},24,{"$f":"IFERROR(LARGE($D6:$L6,E$3),\"\")","v":24},{"$f":"IFERROR(LARGE($D6:$L6,F$3),\"\")","v":""},{"$f":"IFERROR(LARGE($D6:$L6,G$3),\"\")","v":""},{"$f":"IFERROR(LARGE($D6:$L6,H$3),\"\")","v":""},{"$f":"COUNT(P6:T6)","v":2}]
[{"$f":"RANK(N7,$N$5:$N$35,0)","v":3},"John-Paul Hopkinson",{"$f":"VLOOKUP(B7,'Age Cat'!F:G,2,FALSE)","v":"V40"},{"$f":"IFERROR(VLOOKUP($B7,'2017 Road results'!$B$3:$D$22,3,FALSE),\"\")","v":""},null,null,null,null,null,null,{"$f":"IFERROR(VLOOKUP($B7,'2017 marathon & half'!$B$3:$D$14,3,FALSE),\"\")","v":25},{"$f":"IFERROR(VLOOKUP($B7,'2017 marathon & half'!$B$27:$D$42,3,FALSE),\"\")","v":""},25,25,1,25,"","","","",1]
[{"$f":"RANK(N8,$N$5:$N$35,0)","v":3},"Gary Chapman",{"$f":"VLOOKUP(B8,'Age Cat'!F:G,2,FALSE)","v":"V40"},{"$f":"IFERROR(VLOOKUP($B8,'2017 Road results'!$B$3:$D$22,3,FALSE),\"\")","v":""},null,null,null,null,null,null,{"$f":"IFERROR(VLOOKUP($B8,'2017 marathon & half'!$B$3:$D$14,3,FALSE),\"\")","v":""},{"$f":"IFERROR(VLOOKUP($B8,'2017 marathon & half'!$B$27:$D$42,3,FALSE),\"\")","v":25},{"$f":"IF(SUM(D8:L8)=0,\"\",SUM(D8:L8))","v":25},{"$f":"SUM(P8:T8)","v":25},{"$f":"IF(COUNT(D8:L8)=0,\"\",COUNT(D8:L8))","v":1},{"$f":"IFERROR(LARGE($D8:$L8,D$3),\"\")","v":25},{"$f":"IFERROR(LARGE($D8:$L8,E$3),\"\")","v":""},{"$f":"IFERROR(LARGE($D8:$L8,F$3),\"\")","v":""},{"$f":"IFERROR(LARGE($D8:$L8,G$3),\"\")","v":""},{"$f":"IFERROR(LARGE($D8:$L8,H$3),\"\")","v":""},{"$f":"COUNT(P8:T8)","v":1}]
[{"$f":"RANK(N9,$N$5:$N$35,0)","v":5},"Chris Tomes",{"$f":"VLOOKUP(B9,'Age Cat'!F:G,2,FALSE)","v":"V60"},{"$f":"IFERROR(VLOOKUP($B9,'2017 Road results'!$B$3:$D$22,3,FALSE),\"\")","v":24},null,null,null,null,null,null,{"$f":"IFERROR(VLOOKUP($B9,'2017 marathon & half'!$B$3:$D$14,3,FALSE),\"\")","v":""},{"$f":"IFERROR(VLOOKUP($B9,'2017 marathon & half'!$B$27:$D$42,3,FALSE),\"\")","v":""},24,24,1,24,"","","","",1]
[{"$f":"RANK(N10,$N$5:$N$35,0)","v":6},"John Conroy",{"$f":"VLOOKUP(B10,'Age Cat'!F:G,2,FALSE)","v":"V40"},{"$f":"IFERROR(VLOOKUP($B10,'2017 Road results'!$B$3:$D$22,3,FALSE),\"\")","v":""},null,null,null,null,null,null,{"$f":"IFERROR(VLOOKUP($B10,'2017 marathon & half'!$B$3:$D$14,3,FALSE),\"\")","v":23},{"$f":"IFERROR(VLOOKUP($B10,'2017 marathon & half'!$B$27:$D$42,3,FALSE),\"\")","v":""},23,{"$f":"SUM(P10:T10)","v":23},{"$f":"IF(COUNT(D10:L10)=0,\"\",COUNT(D10:L10))","v":1},23,{"$f":"IFERROR(LARGE($D10:$L10,E$3),\"\")","v":""},"","","",{"$f":"COUNT(P10:T10)","v":1}]
[{"$f":"RANK(N11,$N$5:$N$35,0)","v":6},"Paul Wilson",{"$f":"VLOOKUP(B11,'Age Cat'!F:G,2,FALSE)","v":"V40"},{"$f":"IFERROR(VLOOKUP($B11,'2017 Road results'!$B$3:$D$22,3,FALSE),\"\")","v":23},null,null,null,null,null,null,{"$f":"IFERROR(VLOOKUP($B11,'2017 marathon & half'!$B$3:$D$14,3,FALSE),\"\")","v":""},{"$f":"IFERROR(VLOOKUP($B11,'2017 marathon & half'!$B$27:$D$42,3,FALSE),\"\")","v":""},23,{"$f":"SUM(P11:T11)","v":23},{"$f":"IF(COUNT(D11:L11)=0,\"\",COUNT(D11:L11))","v":1},23,"","","","",{"$f":"COUNT(P11:T11)","v":1}]
[{"$f":"RANK(N12,$N$5:$N$35,0)","v":8},"Simon Smallwood",{"$f":"VLOOKUP(B12,'Age Cat'!F:G,2,FALSE)","v":"V50"},{"$f":"IFERROR(VLOOKUP($B12,'2017 Road results'!$B$3:$D$22,3,FALSE),\"\")","v":""},null,null,null,null,null,null,{"$f":"IFERROR(VLOOKUP($B12,'2017 marathon & half'!$B$3:$D$14,3,FALSE),\"\")","v":""},{"$f":"IFERROR(VLOOKUP($B12,'2017 marathon & half'!$B$27:$D$42,3,FALSE),\"\")","v":22},22,{"$f":"SUM(P12:T12)","v":22},{"$f":"IF(COUNT(D12:L12)=0,\"\",COUNT(D12:L12))","v":1},22,"","","","",{"$f":"COUNT(P12:T12)","v":1}]
[{"$f":"RANK(N13,$N$5:$N$35,0)","v":8},"Joe Atherton",{"$f":"VLOOKUP(B13,'Age Cat'!F:G,2,FALSE)","v":"V30"},{"$f":"IFERROR(VLOOKUP($B13,'2017 Road results'!$B$3:$D$22,3,FALSE),\"\")","v":""},null,null,null,null,null,null,{"$f":"IFERROR(VLOOKUP($B13,'2017 marathon & half'!$B$3:$D$14,3,FALSE),\"\")","v":22},{"$f":"IFERROR(VLOOKUP($B13,'2017 marathon & half'!$B$27:$D$42,3,FALSE),\"\")","v":""},22,{"$f":"SUM(P13:T13)","v":22},{"$f":"IF(COUNT(D13:L13)=0,\"\",COUNT(D13:L13))","v":1},22,"","","","",{"$f":"COUNT(P13:T13)","v":1}]
[{"$f":"RANK(N14,$N$5:$N$35,0)","v":8},"Richard Butter",{"$f":"VLOOKUP(B14,'Age Cat'!F:G,2,FALSE)","v":"V40"},{"$f":"IFERROR(VLOOKUP($B14,'2017 Road results'!$B$3:$D$22,3,FALSE),\"\")","v":22},null,null,null,null,null,null,{"$f":"IFERROR(VLOOKUP($B14,'2017 marathon & half'!$B$3:$D$14,3,FALSE),\"\")","v":""},{"$f":"IFERROR(VLOOKUP($B14,'2017 marathon & half'!$B$27:$D$42,3,FALSE),\"\")","v":""},22,22,1,22,"","","","",1]
[{"$f":"RANK(N15,$N$5:$N$35,0)","v":11},"Anand Raval",{"$f":"VLOOKUP(B15,'Age Cat'!F:G,2,FALSE)","v":"V30"},{"$f":"IFERROR(VLOOKUP($B15,'2017 Road results'!$B$3:$D$22,3,FALSE),\"\")","v":21},null,null,null,null,null,null,{"$f":"IFERROR(VLOOKUP($B15,'2017 marathon & half'!$B$3:$D$14,3,FALSE),\"\")","v":""},{"$f":"IFERROR(VLOOKUP($B15,'2017 marathon & half'!$B$27:$D$42,3,FALSE),\"\")","v":""},21,21,1,{"$f":"IFERROR(LARGE($D15:$L15,D$3),\"\")","v":21},{"$f":"IFERROR(LARGE($D15:$L15,E$3),\"\")","v":""},{"$f":"IFERROR(LARGE($D15:$L15,F$3),\"\")","v":""},{"$f":"IFERROR(LARGE($D15:$L15,G$3),\"\")","v":""},{"$f":"IFERROR(LARGE($D15:$L15,H$3),\"\")","v":""},1]
[{"$f":"RANK(N16,$N$5:$N$35,0)","v":12},"Simon Chester",{"$f":"VLOOKUP(B16,'Age Cat'!F:G,2,FALSE)","v":"V40"},{"$f":"IFERROR(VLOOKUP($B16,'2017 Road results'!$B$3:$D$22,3,FALSE),\"\")","v":20},null,null,null,null,null,null,{"$f":"IFERROR(VLOOKUP($B16,'2017 marathon & half'!$B$3:$D$14,3,FALSE),\"\")","v":""},{"$f":"IFERROR(VLOOKUP($B16,'2017 marathon & half'!$B$27:$D$42,3,FALSE),\"\")","v":""},20,20,1,20,"","","","",1]
[{"$f":"A16+1","v":13},null,null,{"$f":"IFERROR(VLOOKUP($B17,'2017 Road results'!$B$3:$D$22,3,FALSE),\"\")","v":""},{"$f":"IFERROR(VLOOKUP($B17,'[1]2017 road results'!$B$18:$D$29,3,FALSE),\"\")","v":""},{"$f":"IFERROR(VLOOKUP($B17,'2017 Road results'!#REF!,3,FALSE),\"\")","v":""},{"$f":"IFERROR(VLOOKUP($B17,'2017 Road results'!#REF!,3,FALSE),\"\")","v":""},{"$f":"IFERROR(VLOOKUP($B17,'2017 Road results'!#REF!,3,FALSE),\"\")","v":""},{"$f":"IFERROR(VLOOKUP($B17,'2017 Road results'!$B$15:$D$21,3,FALSE),\"\")","v":""},{"$f":"IFERROR(VLOOKUP($B17,'2017 Road results'!#REF!,3,FALSE),\"\")","v":""},{"$f":"IFERROR(VLOOKUP($B17,'2017 Road results'!#REF!,3,FALSE),\"\")","v":""},{"$f":"IFERROR(VLOOKUP($B17,'2017 Road results'!#REF!,3,FALSE),\"\")","v":""},"",0,"","","","","","",0]
[14,null,null,{"$f":"IFERROR(VLOOKUP($B18,'2017 Road results'!$B$3:$D$22,3,FALSE),\"\")","v":""},{"$f":"IFERROR(VLOOKUP($B18,'[1]2017 road results'!$B$18:$D$29,3,FALSE),\"\")","v":""},{"$f":"IFERROR(VLOOKUP($B18,'2017 Road results'!#REF!,3,FALSE),\"\")","v":""},{"$f":"IFERROR(VLOOKUP($B18,'2017 Road results'!#REF!,3,FALSE),\"\")","v":""},{"$f":"IFERROR(VLOOKUP($B18,'2017 Road results'!#REF!,3,FALSE),\"\")","v":""},{"$f":"IFERROR(VLOOKUP($B18,'2017 Road results'!$B$15:$D$21,3,FALSE),\"\")","v":""},{"$f":"IFERROR(VLOOKUP($B18,'2017 Road results'!#REF!,3,FALSE),\"\")","v":""},{"$f":"IFERROR(VLOOKUP($B18,'2017 Road results'!#REF!,3,FALSE),\"\")","v":""},{"$f":"IFERROR(VLOOKUP($B18,'2017 Road results'!#REF!,3,FALSE),\"\")","v":""},"",0,"","","","","","",0]
[15,null,null,{"$f":"IFERROR(VLOOKUP($B19,'2017 Road results'!$B$3:$D$22,3,FALSE),\"\")","v":""},{"$f":"IFERROR(VLOOKUP($B19,'[1]2017 road results'!$B$18:$D$29,3,FALSE),\"\")","v":""},{"$f":"IFERROR(VLOOKUP($B19,'2017 Road results'!#REF!,3,FALSE),\"\")","v":""},{"$f":"IFERROR(VLOOKUP($B19,'2017 Road results'!#REF!,3,FALSE),\"\")","v":""},{"$f":"IFERROR(VLOOKUP($B19,'2017 Road results'!#REF!,3,FALSE),\"\")","v":""},{"$f":"IFERROR(VLOOKUP($B19,'2017 Road results'!$B$15:$D$21,3,FALSE),\"\")","v":""},{"$f":"IFERROR(VLOOKUP($B19,'2017 Road results'!#REF!,3,FALSE),\"\")","v":""},{"$f":"IFERROR(VLOOKUP($B19,'2017 Road results'!#REF!,3,FALSE),\"\")","v":""},{"$f":"IFERROR(VLOOKUP($B19,'2017 Road results'!#REF!,3,FALSE),\"\")","v":""},"",0,"","","","","","",0]
[16,null,null,{"$f":"IFERROR(VLOOKUP($B20,'2017 Road results'!$B$3:$D$22,3,FALSE),\"\")","v":""},{"$f":"IFERROR(VLOOKUP($B20,'[1]2017 road results'!$B$18:$D$29,3,FALSE),\"\")","v":""},{"$f":"IFERROR(VLOOKUP($B20,'2017 Road results'!#REF!,3,FALSE),\"\")","v":""},{"$f":"IFERROR(VLOOKUP($B20,'2017 Road results'!#REF!,3,FALSE),\"\")","v":""},{"$f":"IFERROR(VLOOKUP($B20,'2017 Road results'!#REF!,3,FALSE),\"\")","v":""},{"$f":"IFERROR(VLOOKUP($B20,'2017 Road results'!$B$15:$D$21,3,FALSE),\"\")","v":""},{"$f":"IFERROR(VLOOKUP($B20,'2017 Road results'!#REF!,3,FALSE),\"\")","v":""},{"$f":"IFERROR(VLOOKUP($B20,'2017 Road results'!#REF!,3,FALSE),\"\")","v":""},{"$f":"IFERROR(VLOOKUP($B20,'2017 Road results'!#REF!,3,FALSE),\"\")","v":""},"",0,"","","","","","",0]
[17,null,null,{"$f":"IFERROR(VLOOKUP($B21,'2017 Road results'!$B$3:$D$22,3,FALSE),\"\")","v":""},{"$f":"IFERROR(VLOOKUP($B21,'[1]2017 road results'!$B$18:$D$29,3,FALSE),\"\")","v":""},{"$f":"IFERROR(VLOOKUP($B21,'2017 Road results'!#REF!,3,FALSE),\"\")","v":""},{"$f":"IFERROR(VLOOKUP($B21,'2017 Road results'!#REF!,3,FALSE),\"\")","v":""},{"$f":"IFERROR(VLOOKUP($B21,'2017 Road results'!#REF!,3,FALSE),\"\")","v":""},{"$f":"IFERROR(VLOOKUP($B21,'2017 Road results'!$B$15:$D$21,3,FALSE),\"\")","v":""},{"$f":"IFERROR(VLOOKUP($B21,'2017 Road results'!#REF!,3,FALSE),\"\")","v":""},{"$f":"IFERROR(VLOOKUP($B21,'2017 Road results'!#REF!,3,FALSE),\"\")","v":""},{"$f":"IFERROR(VLOOKUP($B21,'2017 Road results'!#REF!,3,FALSE),\"\")","v":""},"",0,"","","","","","",0]
[18,null,null,{"$f":"IFERROR(VLOOKUP($B22,'2017 Road results'!$B$3:$D$22,3,FALSE),\"\")","v":""},{"$f":"IFERROR(VLOOKUP($B22,'[1]2017 road results'!$B$18:$D$29,3,FALSE),\"\")","v":""},{"$f":"IFERROR(VLOOKUP($B22,'2017 Road results'!#REF!,3,FALSE),\"\")","v":""},{"$f":"IFERROR(VLOOKUP($B22,'2017 Road results'!#REF!,3,FALSE),\"\")","v":""},{"$f":"IFERROR(VLOOKUP($B22,'2017 Road results'!#REF!,3,FALSE),\"\")","v":""},{"$f":"IFERROR(VLOOKUP($B22,'2017 Road results'!$B$15:$D$21,3,FALSE),\"\")","v":""},{"$f":"IFERROR(VLOOKUP($B22,'2017 Road results'!#REF!,3,FALSE),\"\")","v":""},{"$f":"IFERROR(VLOOKUP($B22,'2017 Road results'!#REF!,3,FALSE),\"\")","v":""},{"$f":"IFERROR(VLOOKUP($B22,'2017 Road results'!#REF!,3,FALSE),\"\")","v":""},"",0,"","","","","","",0]
[19,null,null,{"$f":"IFERROR(VLOOKUP($B23,'2017 Road results'!$B$3:$D$22,3,FALSE),\"\")","v":""},{"$f":"IFERROR(VLOOKUP($B23,'[1]2017 road results'!$B$18:$D$29,3,FALSE),\"\")","v":""},{"$f":"IFERROR(VLOOKUP($B23,'2017 Road results'!#REF!,3,FALSE),\"\")","v":""},{"$f":"IFERROR(VLOOKUP($B23,'2017 Road results'!#REF!,3,FALSE),\"\")","v":""},{"$f":"IFERROR(VLOOKUP($B23,'2017 Road results'!#REF!,3,FALSE),\"\")","v":""},{"$f":"IFERROR(VLOOKUP($B23,'2017 Road results'!$B$15:$D$21,3,FALSE),\"\")","v":""},{"$f":"IFERROR(VLOOKUP($B23,'2017 Road results'!#REF!,3,FALSE),\"\")","v":""},{"$f":"IFERROR(VLOOKUP($B23,'2017 Road results'!#REF!,3,FALSE),\"\")","v":""},{"$f":"IFERROR(VLOOKUP($B23,'2017 Road results'!#REF!,3,FALSE),\"\")","v":""},"",0,"","","","","","",0]
[20,null,null,{"$f":"IFERROR(VLOOKUP($B24,'2017 Road results'!$B$3:$D$22,3,FALSE),\"\")","v":""},{"$f":"IFERROR(VLOOKUP($B24,'[1]2017 road results'!$B$18:$D$29,3,FALSE),\"\")","v":""},{"$f":"IFERROR(VLOOKUP($B24,'2017 Road results'!#REF!,3,FALSE),\"\")","v":""},{"$f":"IFERROR(VLOOKUP($B24,'2017 Road results'!#REF!,3,FALSE),\"\")","v":""},{"$f":"IFERROR(VLOOKUP($B24,'2017 Road results'!#REF!,3,FALSE),\"\")","v":""},{"$f":"IFERROR(VLOOKUP($B24,'2017 Road results'!$B$15:$D$21,3,FALSE),\"\")","v":""},{"$f":"IFERROR(VLOOKUP($B24,'2017 Road results'!#REF!,3,FALSE),\"\")","v":""},{"$f":"IFERROR(VLOOKUP($B24,'2017 Road results'!#REF!,3,FALSE),\"\")","v":""},{"$f":"IFERROR(VLOOKUP($B24,'2017 Road results'!#REF!,3,FALSE),\"\")","v":""},{"$f":"IF(SUM(D24:L24)=0,\"\",SUM(D24:L24))","v":""},0,"","","","","","",0]
[21,null,null,{"$f":"IFERROR(VLOOKUP($B25,'2017 Road results'!$B$3:$D$22,3,FALSE),\"\")","v":""},{"$f":"IFERROR(VLOOKUP($B25,'[1]2017 road results'!$B$18:$D$29,3,FALSE),\"\")","v":""},{"$f":"IFERROR(VLOOKUP($B25,'2017 Road results'!#REF!,3,FALSE),\"\")","v":""},{"$f":"IFERROR(VLOOKUP($B25,'2017 Road results'!#REF!,3,FALSE),\"\")","v":""},{"$f":"IFERROR(VLOOKUP($B25,'2017 Road results'!#REF!,3,FALSE),\"\")","v":""},{"$f":"IFERROR(VLOOKUP($B25,'2017 Road results'!$B$15:$D$21,3,FALSE),\"\")","v":""},{"$f":"IFERROR(VLOOKUP($B25,'2017 Road results'!#REF!,3,FALSE),\"\")","v":""},{"$f":"IFERROR(VLOOKUP($B25,'2017 Road results'!#REF!,3,FALSE),\"\")","v":""},{"$f":"IFERROR(VLOOKUP($B25,'2017 Road results'!#REF!,3,FALSE),\"\")","v":""},"",0,"","","","","","",0]
[22,null,null,{"$f":"IFERROR(VLOOKUP($B26,'2017 Road results'!$B$3:$D$22,3,FALSE),\"\")","v":""},{"$f":"IFERROR(VLOOKUP($B26,'[1]2017 road results'!$B$18:$D$29,3,FALSE),\"\")","v":""},{"$f":"IFERROR(VLOOKUP($B26,'2017 Road results'!#REF!,3,FALSE),\"\")","v":""},{"$f":"IFERROR(VLOOKUP($B26,'2017 Road results'!#REF!,3,FALSE),\"\")","v":""},{"$f":"IFERROR(VLOOKUP($B26,'2017 Road results'!#REF!,3,FALSE),\"\")","v":""},{"$f":"IFERROR(VLOOKUP($B26,'2017 Road results'!$B$15:$D$21,3,FALSE),\"\")","v":""},{"$f":"IFERROR(VLOOKUP($B26,'2017 Road results'!#REF!,3,FALSE),\"\")","v":""},{"$f":"IFERROR(VLOOKUP($B26,'2017 Road results'!#REF!,3,FALSE),\"\")","v":""},{"$f":"IFERROR(VLOOKUP($B26,'2017 Road results'!#REF!,3,FALSE),\"\")","v":""},"",0,"","","","","","",0]
[23,null,null,{"$f":"IFERROR(VLOOKUP($B27,'2017 Road results'!$B$3:$D$22,3,FALSE),\"\")","v":""},{"$f":"IFERROR(VLOOKUP($B27,'[1]2017 road results'!$B$18:$D$29,3,FALSE),\"\")","v":""},{"$f":"IFERROR(VLOOKUP($B27,'2017 Road results'!#REF!,3,FALSE),\"\")","v":""},{"$f":"IFERROR(VLOOKUP($B27,'2017 Road results'!#REF!,3,FALSE),\"\")","v":""},{"$f":"IFERROR(VLOOKUP($B27,'2017 Road results'!#REF!,3,FALSE),\"\")","v":""},{"$f":"IFERROR(VLOOKUP($B27,'2017 Road results'!$B$15:$D$21,3,FALSE),\"\")","v":""},{"$f":"IFERROR(VLOOKUP($B27,'2017 Road results'!#REF!,3,FALSE),\"\")","v":""},{"$f":"IFERROR(VLOOKUP($B27,'2017 Road results'!#REF!,3,FALSE),\"\")","v":""},{"$f":"IFERROR(VLOOKUP($B27,'2017 Road results'!#REF!,3,FALSE),\"\")","v":""},"",0,"","","","","","",0]
[24,null,null,{"$f":"IFERROR(VLOOKUP($B28,'2017 Road results'!$B$3:$D$22,3,FALSE),\"\")","v":""},{"$f":"IFERROR(VLOOKUP($B28,'[1]2017 road results'!$B$18:$D$29,3,FALSE),\"\")","v":""},{"$f":"IFERROR(VLOOKUP($B28,'2017 Road results'!#REF!,3,FALSE),\"\")","v":""},{"$f":"IFERROR(VLOOKUP($B28,'2017 Road results'!#REF!,3,FALSE),\"\")","v":""},{"$f":"IFERROR(VLOOKUP($B28,'2017 Road results'!#REF!,3,FALSE),\"\")","v":""},{"$f":"IFERROR(VLOOKUP($B28,'2017 Road results'!$B$15:$D$21,3,FALSE),\"\")","v":""},{"$f":"IFERROR(VLOOKUP($B28,'2017 Road results'!#REF!,3,FALSE),\"\")","v":""},{"$f":"IFERROR(VLOOKUP($B28,'2017 Road results'!#REF!,3,FALSE),\"\")","v":""},{"$f":"IFERROR(VLOOKUP($B28,'2017 Road results'!#REF!,3,FALSE),\"\")","v":""},"",0,"","","","","","",0,null,null," "]
[25,null,null,{"$f":"IFERROR(VLOOKUP($B29,'2017 Road results'!$B$3:$D$22,3,FALSE),\"\")","v":""},{"$f":"IFERROR(VLOOKUP($B29,'[1]2017 road results'!$B$18:$D$29,3,FALSE),\"\")","v":""},{"$f":"IFERROR(VLOOKUP($B29,'2017 Road results'!#REF!,3,FALSE),\"\")","v":""},{"$f":"IFERROR(VLOOKUP($B29,'2017 Road results'!#REF!,3,FALSE),\"\")","v":""},{"$f":"IFERROR(VLOOKUP($B29,'2017 Road results'!#REF!,3,FALSE),\"\")","v":""},{"$f":"IFERROR(VLOOKUP($B29,'2017 Road results'!$B$15:$D$21,3,FALSE),\"\")","v":""},{"$f":"IFERROR(VLOOKUP($B29,'2017 Road results'!#REF!,3,FALSE),\"\")","v":""},{"$f":"IFERROR(VLOOKUP($B29,'2017 Road results'!#REF!,3,FALSE),\"\")","v":""},{"$f":"IFERROR(VLOOKUP($B29,'2017 Road results'!#REF!,3,FALSE),\"\")","v":""},"",0,"","","","","","",0]
[26,null,null,{"$f":"IFERROR(VLOOKUP($B30,'2017 Road results'!$B$3:$D$22,3,FALSE),\"\")","v":""},{"$f":"IFERROR(VLOOKUP($B30,'[1]2017 road results'!$B$18:$D$29,3,FALSE),\"\")","v":""},{"$f":"IFERROR(VLOOKUP($B30,'2017 Road results'!#REF!,3,FALSE),\"\")","v":""},{"$f":"IFERROR(VLOOKUP($B30,'2017 Road results'!#REF!,3,FALSE),\"\")","v":""},{"$f":"IFERROR(VLOOKUP($B30,'2017 Road results'!#REF!,3,FALSE),\"\")","v":""},{"$f":"IFERROR(VLOOKUP($B30,'2017 Road results'!$B$15:$D$21,3,FALSE),\"\")","v":""},{"$f":"IFERROR(VLOOKUP($B30,'2017 Road results'!#REF!,3,FALSE),\"\")","v":""},{"$f":"IFERROR(VLOOKUP($B30,'2017 Road results'!#REF!,3,FALSE),\"\")","v":""},{"$f":"IFERROR(VLOOKUP($B30,'2017 Road results'!#REF!,3,FALSE),\"\")","v":""},"",0,"","","","","","",0]
[27,null,null,{"$f":"IFERROR(VLOOKUP($B31,'2017 Road results'!$B$3:$D$22,3,FALSE),\"\")","v":""},{"$f":"IFERROR(VLOOKUP($B31,'[1]2017 road results'!$B$18:$D$29,3,FALSE),\"\")","v":""},{"$f":"IFERROR(VLOOKUP($B31,'2017 Road results'!#REF!,3,FALSE),\"\")","v":""},{"$f":"IFERROR(VLOOKUP($B31,'2017 Road results'!#REF!,3,FALSE),\"\")","v":""},{"$f":"IFERROR(VLOOKUP($B31,'2017 Road results'!#REF!,3,FALSE),\"\")","v":""},{"$f":"IFERROR(VLOOKUP($B31,'2017 Road results'!$B$15:$D$21,3,FALSE),\"\")","v":""},{"$f":"IFERROR(VLOOKUP($B31,'2017 Road results'!#REF!,3,FALSE),\"\")","v":""},{"$f":"IFERROR(VLOOKUP($B31,'2017 Road results'!#REF!,3,FALSE),\"\")","v":""},{"$f":"IFERROR(VLOOKUP($B31,'2017 Road results'!#REF!,3,FALSE),\"\")","v":""},"",0,"","","","","","",0]
[{"$f":"A31+1","v":28},null,null,{"$f":"IFERROR(VLOOKUP($B32,'2017 Road results'!$B$3:$D$22,3,FALSE),\"\")","v":""},{"$f":"IFERROR(VLOOKUP($B32,'[1]2017 road results'!$B$18:$D$29,3,FALSE),\"\")","v":""},{"$f":"IFERROR(VLOOKUP($B32,'2017 Road results'!#REF!,3,FALSE),\"\")","v":""},{"$f":"IFERROR(VLOOKUP($B32,'2017 Road results'!#REF!,3,FALSE),\"\")","v":""},{"$f":"IFERROR(VLOOKUP($B32,'2017 Road results'!#REF!,3,FALSE),\"\")","v":""},{"$f":"IFERROR(VLOOKUP($B32,'2017 Road results'!$B$15:$D$21,3,FALSE),\"\")","v":""},{"$f":"IFERROR(VLOOKUP($B32,'2017 Road results'!#REF!,3,FALSE),\"\")","v":""},{"$f":"IFERROR(VLOOKUP($B32,'2017 Road results'!#REF!,3,FALSE),\"\")","v":""},{"$f":"IFERROR(VLOOKUP($B32,'2017 Road results'!#REF!,3,FALSE),\"\")","v":""},"",0,"","","","","","",0]
[29,null,null,{"$f":"IFERROR(VLOOKUP($B33,'2017 Road results'!$B$3:$D$22,3,FALSE),\"\")","v":""},{"$f":"IFERROR(VLOOKUP($B33,'[1]2017 road results'!$B$18:$D$29,3,FALSE),\"\")","v":""},{"$f":"IFERROR(VLOOKUP($B33,'2017 Road results'!#REF!,3,FALSE),\"\")","v":""},{"$f":"IFERROR(VLOOKUP($B33,'2017 Road results'!#REF!,3,FALSE),\"\")","v":""},{"$f":"IFERROR(VLOOKUP($B33,'2017 Road results'!#REF!,3,FALSE),\"\")","v":""},{"$f":"IFERROR(VLOOKUP($B33,'2017 Road results'!$B$15:$D$21,3,FALSE),\"\")","v":""},{"$f":"IFERROR(VLOOKUP($B33,'2017 Road results'!#REF!,3,FALSE),\"\")","v":""},{"$f":"IFERROR(VLOOKUP($B33,'2017 Road results'!#REF!,3,FALSE),\"\")","v":""},{"$f":"IFERROR(VLOOKUP($B33,'2017 Road results'!#REF!,3,FALSE),\"\")","v":""},"",0,"","","","","","",0]
[30,null,null,{"$f":"IFERROR(VLOOKUP($B34,'2017 Road results'!$B$3:$D$22,3,FALSE),\"\")","v":""},{"$f":"IFERROR(VLOOKUP($B34,'[1]2017 road results'!$B$18:$D$29,3,FALSE),\"\")","v":""},{"$f":"IFERROR(VLOOKUP($B34,'2017 Road results'!#REF!,3,FALSE),\"\")","v":""},{"$f":"IFERROR(VLOOKUP($B34,'2017 Road results'!#REF!,3,FALSE),\"\")","v":""},{"$f":"IFERROR(VLOOKUP($B34,'2017 Road results'!#REF!,3,FALSE),\"\")","v":""},{"$f":"IFERROR(VLOOKUP($B34,'2017 Road results'!$B$15:$D$21,3,FALSE),\"\")","v":""},{"$f":"IFERROR(VLOOKUP($B34,'2017 Road results'!#REF!,3,FALSE),\"\")","v":""},{"$f":"IFERROR(VLOOKUP($B34,'2017 Road results'!#REF!,3,FALSE),\"\")","v":""},{"$f":"IFERROR(VLOOKUP($B34,'2017 Road results'!#REF!,3,FALSE),\"\")","v":""},"",0,"","","","","","",0]
[31,null,null,{"$f":"IFERROR(VLOOKUP($B35,'2017 Road results'!$B$3:$D$22,3,FALSE),\"\")","v":""},{"$f":"IFERROR(VLOOKUP($B35,'[1]2017 road results'!$B$18:$D$29,3,FALSE),\"\")","v":""},{"$f":"IFERROR(VLOOKUP($B35,'2017 Road results'!#REF!,3,FALSE),\"\")","v":""},{"$f":"IFERROR(VLOOKUP($B35,'2017 Road results'!#REF!,3,FALSE),\"\")","v":""},{"$f":"IFERROR(VLOOKUP($B35,'2017 Road results'!#REF!,3,FALSE),\"\")","v":""},{"$f":"IFERROR(VLOOKUP($B35,'2017 Road results'!$B$15:$D$21,3,FALSE),\"\")","v":""},{"$f":"IFERROR(VLOOKUP($B35,'2017 Road results'!#REF!,3,FALSE),\"\")","v":""},{"$f":"IFERROR(VLOOKUP($B35,'2017 Road results'!#REF!,3,FALSE),\"\")","v":""},{"$f":"IFERROR(VLOOKUP($B35,'2017 Road results'!#REF!,3,FALSE),\"\")","v":""},"",0,"",{"$f":"IFERROR(LARGE($D35:$L35,D$3),\"\")","v":""},null,null,{"$f":"IFERROR(LARGE($D35:$L35,I$3),\"\")","v":""},{"$f":"IFERROR(LARGE($D35:$L35,J$3),\"\")","v":""},0]
[]
["Pos","Name",null,{"$f":"D3","v":1},2,3,4,5,6,7,8,9,"Total","Scoring Total","# Races","Top 5 Results"]
[null,null,null,{"$f":"VLOOKUP(D37,$A$60:$C$68,2,FALSE)","v":"2017-03-19"},{"$f":"VLOOKUP(E37,$A$60:$C$68,2,FALSE)","v":"May"},{"$f":"VLOOKUP(F37,$A$60:$C$68,2,FALSE)","v":"2017-06-08"},{"$f":"VLOOKUP(G37,$A$60:$C$68,2,FALSE)","v":"2017-07-05"},{"$f":"VLOOKUP(H37,$A$60:$C$68,2,FALSE)","v":"2017-08-03"},{"$f":"VLOOKUP(I37,$A$60:$C$68,2,FALSE)","v":"2017-08-19"},{"$f":"VLOOKUP(J37,$A$60:$C$68,2,FALSE)","v":"2017-10-29"},null,null,null,null,null,{"$f":"D37","v":1},2,3,4,5]
[{"$f":"RANK(N39,$N$39:$N$57,0)","v":1},"Hannah Yates",{"$f":"VLOOKUP(B39,'Age Cat'!F:G,2,FALSE)","v":"S"},{"$f":"IFERROR(VLOOKUP($B39,'2017 Road results'!$B$3:$D$22,3,FALSE),\"\")","v":20},null,null,null,null,null,null,{"$f":"IFERROR(VLOOKUP($B39,'2017 marathon & half'!$B$16:$D$34,3,FALSE),\"\")","v":24},{"$f":"IFERROR(VLOOKUP($B39,'2017 marathon & half'!$B$37:$D$52,3,FALSE),\"\")","v":22},{"$f":"IF(SUM(D39:L39)=0,\"\",SUM(D39:L39))","v":66},{"$f":"SUM(P39:T39)","v":66},{"$f":"IF(COUNT(D39:L39)=0,\"\",COUNT(D39:L39))","v":3},{"$f":"IFERROR(LARGE($D39:$L39,D$3),\"\")","v":24},{"$f":"IFERROR(LARGE($D39:$L39,E$3),\"\")","v":22},{"$f":"IFERROR(LARGE($D39:$L39,F$3),\"\")","v":20},{"$f":"IFERROR(LARGE($D39:$L39,G$3),\"\")","v":""},{"$f":"IFERROR(LARGE($D39:$L39,H$3),\"\")","v":""},{"$f":"COUNT(P39:T39)","v":3}]
[{"$f":"RANK(N40,$N$39:$N$57,0)","v":2},"Sue Straw",{"$f":"VLOOKUP(B40,'Age Cat'!F:G,2,FALSE)","v":"V40"},{"$f":"IFERROR(VLOOKUP($B40,'2017 Road results'!$B$3:$D$22,3,FALSE),\"\")","v":""},null,null,null,null,null,null,{"$f":"IFERROR(VLOOKUP($B40,'2017 marathon & half'!$B$16:$D$34,3,FALSE),\"\")","v":25},{"$f":"IFERROR(VLOOKUP($B40,'2017 marathon & half'!$B$37:$D$52,3,FALSE),\"\")","v":23},48,48,2,25,23,"","","",2]
[{"$f":"RANK(N41,$N$39:$N$57,0)","v":3},"Amanda Sterling",{"$f":"VLOOKUP(B41,'Age Cat'!F:G,2,FALSE)","v":"V40"},{"$f":"IFERROR(VLOOKUP($B41,'2017 Road results'!$B$3:$D$22,3,FALSE),\"\")","v":23},null,null,null,null,null,null,{"$f":"IFERROR(VLOOKUP($B41,'2017 marathon & half'!$B$16:$D$34,3,FALSE),\"\")","v":""},{"$f":"IFERROR(VLOOKUP($B41,'2017 marathon & half'!$B$37:$D$52,3,FALSE),\"\")","v":24},47,47,2,24,23,"","","",2]
[{"$f":"RANK(N42,$N$39:$N$57,0)","v":4},"Lorraine Bamfield",{"$f":"VLOOKUP(B42,'Age Cat'!F:G,2,FALSE)","v":"V40"},{"$f":"IFERROR(VLOOKUP($B42,'2017 Road results'!$B$3:$D$22,3,FALSE),\"\")","v":""},null,null,null,null,null,null,{"$f":"IFERROR(VLOOKUP($B42,'2017 marathon & half'!$B$16:$D$34,3,FALSE),\"\")","v":20},{"$f":"IFERROR(VLOOKUP($B42,'2017 marathon & half'!$B$37:$D$52,3,FALSE),\"\")","v":21},41,{"$f":"SUM(P42:T42)","v":41},{"$f":"IF(COUNT(D42:L42)=0,\"\",COUNT(D42:L42))","v":2},{"$f":"IFERROR(LARGE($D42:$L42,D$3),\"\")","v":21},{"$f":"IFERROR(LARGE($D42:$L42,E$3),\"\")","v":20},{"$f":"IFERROR(LARGE($D42:$L42,F$3),\"\")","v":""},{"$f":"IFERROR(LARGE($D42:$L42,G$3),\"\")","v":""},{"$f":"IFERROR(LARGE($D42:$L42,H$3),\"\")","v":""},{"$f":"COUNT(P42:T42)","v":2}]
[{"$f":"RANK(N43,$N$39:$N$57,0)","v":5},"Tracey Hodgson",{"$f":"VLOOKUP(B43,'Age Cat'!F:G,2,FALSE)","v":"V30"},{"$f":"IFERROR(VLOOKUP($B43,'2017 Road results'!$B$3:$D$22,3,FALSE),\"\")","v":18},null,null,null,null,null,null,{"$f":"IFERROR(VLOOKUP($B43,'2017 marathon & half'!$B$16:$D$34,3,FALSE),\"\")","v":22},{"$f":"IFERROR(VLOOKUP($B43,'2017 marathon & half'!$B$37:$D$52,3,FALSE),\"\")","v":""},{"$f":"IF(SUM(D43:L43)=0,\"\",SUM(D43:L43))","v":40},{"$f":"SUM(P43:T43)","v":40},{"$f":"IF(COUNT(D43:L43)=0,\"\",COUNT(D43:L43))","v":2},{"$f":"IFERROR(LARGE($D43:$L43,D$3),\"\")","v":22},{"$f":"IFERROR(LARGE($D43:$L43,E$3),\"\")","v":18},{"$f":"IFERROR(LARGE($D43:$L43,F$3),\"\")","v":""},{"$f":"IFERROR(LARGE($D43:$L43,G$3),\"\")","v":""},{"$f":"IFERROR(LARGE($D43:$L43,H$3),\"\")","v":""},{"$f":"COUNT(P43:T43)","v":2}]
[{"$f":"RANK(N44,$N$39:$N$57,0)","v":6},"Tizz Woffenden",{"$f":"VLOOKUP(B44,'Age Cat'!F:G,2,FALSE)","v":"V40"},{"$f":"IFERROR(VLOOKUP($B44,'2017 Road results'!$B$3:$D$22,3,FALSE),\"\")","v":25},null,null,null,null,null,null,{"$f":"IFERROR(VLOOKUP($B44,'2017 marathon & half'!$B$16:$D$34,3,FALSE),\"\")","v":""},{"$f":"IFERROR(VLOOKUP($B44,'2017 marathon & half'!$B$37:$D$52,3,FALSE),\"\")","v":""},25,25,1,25,"","","","",1]
[{"$f":"RANK(N45,$N$39:$N$57,0)","v":6},"Claire Cooper",{"$f":"VLOOKUP(B45,'Age Cat'!F:G,2,FALSE)","v":"V30"},{"$f":"IFERROR(VLOOKUP($B45,'2017 Road results'!$B$3:$D$22,3,FALSE),\"\")","v":""},null,null,null,null,null,null,{"$f":"IFERROR(VLOOKUP($B45,'2017 marathon & half'!$B$16:$D$34,3,FALSE),\"\")","v":""},{"$f":"IFERROR(VLOOKUP($B45,'2017 marathon & half'!$B$37:$D$52,3,FALSE),\"\")","v":25},25,25,1,25,"","","","",1]
[{"$f":"RANK(N46,$N$39:$N$57,0)","v":8},"Sarah O'Sullivan",{"$f":"VLOOKUP(B46,'Age Cat'!F:G,2,FALSE)","v":"V40"},{"$f":"IFERROR(VLOOKUP($B46,'2017 Road results'!$B$3:$D$22,3,FALSE),\"\")","v":24},null,null,null,null,null,null,{"$f":"IFERROR(VLOOKUP($B46,'2017 marathon & half'!$B$16:$D$34,3,FALSE),\"\")","v":""},{"$f":"IFERROR(VLOOKUP($B46,'2017 marathon & half'!$B$37:$D$52,3,FALSE),\"\")","v":""},24,24,1,24,"","","","",1]
[{"$f":"RANK(N47,$N$39:$N$57,0)","v":9},"Donna Chester",{"$f":"VLOOKUP(B47,'Age Cat'!F:G,2,FALSE)","v":"V30"},{"$f":"IFERROR(VLOOKUP($B47,'2017 Road results'!$B$3:$D$22,3,FALSE),\"\")","v":""},null,null,null,null,null,null,{"$f":"IFERROR(VLOOKUP($B47,'2017 marathon & half'!$B$16:$D$34,3,FALSE),\"\")","v":23},{"$f":"IFERROR(VLOOKUP($B47,'2017 marathon & half'!$B$37:$D$52,3,FALSE),\"\")","v":""},23,{"$f":"SUM(P47:T47)","v":23},{"$f":"IF(COUNT(D47:L47)=0,\"\",COUNT(D47:L47))","v":1},{"$f":"IFERROR(LARGE($D47:$L47,D$3),\"\")","v":23},"","","","",{"$f":"COUNT(P47:T47)","v":1}]
[{"$f":"RANK(N48,$N$39:$N$57,0)","v":10},"Camille Askins",{"$f":"VLOOKUP(B48,'Age Cat'!F:G,2,FALSE)","v":"V40"},{"$f":"IFERROR(VLOOKUP($B48,'2017 Road results'!$B$3:$D$22,3,FALSE),\"\")","v":22},null,null,null,null,null,null,{"$f":"IFERROR(VLOOKUP($B48,'2017 marathon & half'!$B$16:$D$34,3,FALSE),\"\")","v":""},{"$f":"IFERROR(VLOOKUP($B48,'2017 marathon & half'!$B$37:$D$52,3,FALSE),\"\")","v":""},22,{"$f":"SUM(P48:T48)","v":22},{"$f":"IF(COUNT(D48:L48)=0,\"\",COUNT(D48:L48))","v":1},22,"","","","",{"$f":"COUNT(P48:T48)","v":1}]
[{"$f":"RANK(N49,$N$39:$N$57,0)","v":11},"Heather Crow",{"$f":"VLOOKUP(B49,'Age Cat'!F:G,2,FALSE)","v":"S"},{"$f":"IFERROR(VLOOKUP($B49,'2017 Road results'!$B$3:$D$22,3,FALSE),\"\")","v":""},null,null,null,null,null,null,{"$f":"IFERROR(VLOOKUP($B49,'2017 marathon & half'!$B$16:$D$34,3,FALSE),\"\")","v":21},{"$f":"IFERROR(VLOOKUP($B49,'2017 marathon & half'!$B$37:$D$52,3,FALSE),\"\")","v":""},21,{"$f":"SUM(P49:T49)","v":21},{"$f":"IF(COUNT(D49:L49)=0,\"\",COUNT(D49:L49))","v":1},21,"","","","",{"$f":"COUNT(P49:T49)","v":1}]
[{"$f":"RANK(N50,$N$39:$N$57,0)","v":11},"Kayleigh Fish",{"$f":"VLOOKUP(B50,'Age Cat'!F:G,2,FALSE)","v":"S"},{"$f":"IFERROR(VLOOKUP($B50,'2017 Road results'!$B$3:$D$22,3,FALSE),\"\")","v":21},null,null,null,null,null,null,{"$f":"IFERROR(VLOOKUP($B50,'2017 marathon & half'!$B$16:$D$34,3,FALSE),\"\")","v":""},{"$f":"IFERROR(VLOOKUP($B50,'2017 marathon & half'!$B$37:$D$52,3,FALSE),\"\")","v":""},21,21,1,21,"","","","",1]
[{"$f":"RANK(N51,$N$39:$N$57,0)","v":13},"Samantha Knowles",{"$f":"VLOOKUP(B51,'Age Cat'!F:G,2,FALSE)","v":"V40"},{"$f":"IFERROR(VLOOKUP($B51,'2017 Road results'!$B$3:$D$22,3,FALSE),\"\")","v":""},null,null,null,null,null,null,{"$f":"IFERROR(VLOOKUP($B51,'2017 marathon & half'!$B$16:$D$34,3,FALSE),\"\")","v":""},{"$f":"IFERROR(VLOOKUP($B51,'2017 marathon & half'!$B$37:$D$52,3,FALSE),\"\")","v":20},20,20,1,20,"","","","",1]
[{"$f":"RANK(N52,$N$39:$N$57,0)","v":14},"Sarah Meikle",{"$f":"VLOOKUP(B52,'Age Cat'!F:G,2,FALSE)","v":"V40"},{"$f":"IFERROR(VLOOKUP($B52,'2017 Road results'!$B$3:$D$22,3,FALSE),\"\")","v":19},null,null,null,null,null,null,{"$f":"IFERROR(VLOOKUP($B52,'2017 marathon & half'!$B$16:$D$34,3,FALSE),\"\")","v":""},{"$f":"IFERROR(VLOOKUP($B52,'2017 marathon & half'!$B$37:$D$52,3,FALSE),\"\")","v":""},19,19,1,19,"","","","",1]
[{"$f":"RANK(N53,$N$39:$N$57,0)","v":15},"Luisa Lauren",{"$f":"VLOOKUP(B53,'Age Cat'!F:G,2,FALSE)","v":"V50"},{"$f":"IFERROR(VLOOKUP($B53,'2017 Road results'!$B$3:$D$22,3,FALSE),\"\")","v":17},null,null,null,null,null,null,{"$f":"IFERROR(VLOOKUP($B53,'2017 marathon & half'!$B$16:$D$34,3,FALSE),\"\")","v":""},{"$f":"IFERROR(VLOOKUP($B53,'2017 marathon & half'!$B$37:$D$52,3,FALSE),\"\")","v":""},17,17,1,17,"","","","",1]
[{"$f":"RANK(N54,$N$39:$N$57,0)","v":16},"Paula Williams",{"$f":"VLOOKUP(B54,'Age Cat'!F:G,2,FALSE)","v":"V40"},{"$f":"IFERROR(VLOOKUP($B54,'2017 Road results'!$B$3:$D$22,3,FALSE),\"\")","v":16},null,null,null,null,null,null,{"$f":"IFERROR(VLOOKUP($B54,'2017 marathon & half'!$B$16:$D$34,3,FALSE),\"\")","v":""},{"$f":"IFERROR(VLOOKUP($B54,'2017 marathon & half'!$B$37:$D$52,3,FALSE),\"\")","v":""},16,{"$f":"SUM(P54:T54)","v":16},{"$f":"IF(COUNT(D54:L54)=0,\"\",COUNT(D54:L54))","v":1},{"$f":"IFERROR(LARGE($D54:$L54,D$3),\"\")","v":16},{"$f":"IFERROR(LARGE($D54:$L54,E$3),\"\")","v":""},{"$f":"IFERROR(LARGE($D54:$L54,F$3),\"\")","v":""},{"$f":"IFERROR(LARGE($D54:$L54,G$3),\"\")","v":""},{"$f":"IFERROR(LARGE($D54:$L54,H$3),\"\")","v":""},{"$f":"COUNT(P54:T54)","v":1}]
[{"$f":"RANK(N55,$N$39:$N$57,0)","v":17},"Catherine Bellwood",{"$f":"VLOOKUP(B55,'Age Cat'!F:G,2,FALSE)","v":"V50"},{"$f":"IFERROR(VLOOKUP($B55,'2017 Road results'!$B$3:$D$22,3,FALSE),\"\")","v":15},null,null,null,null,null,null,{"$f":"IFERROR(VLOOKUP($B55,'2017 marathon & half'!$B$16:$D$34,3,FALSE),\"\")","v":""},{"$f":"IFERROR(VLOOKUP($B55,'2017 marathon & half'!$B$37:$D$52,3,FALSE),\"\")","v":""},15,15,1,15,"","","","",1]
[{"$f":"RANK(N56,$N$39:$N$57,0)","v":18},"Mary Hodgkiss",{"$f":"VLOOKUP(B56,'Age Cat'!F:G,2,FALSE)","v":"V60"},{"$f":"IFERROR(VLOOKUP($B56,'2017 Road results'!$B$3:$D$22,3,FALSE),\"\")","v":14},null,null,null,null,null,null,{"$f":"IFERROR(VLOOKUP($B56,'2017 marathon & half'!$B$16:$D$34,3,FALSE),\"\")","v":""},{"$f":"IFERROR(VLOOKUP($B56,'2017 marathon & half'!$B$37:$D$52,3,FALSE),\"\")","v":""},14,14,1,14,"","","","",1]
[{"$f":"RANK(N57,$N$39:$N$57,0)","v":19},"Andrea Stead",null,{"$f":"IFERROR(VLOOKUP($B57,'2017 Road results'!$B$3:$D$22,3,FALSE),\"\")","v":13},null,null,null,null,null,null,{"$f":"IFERROR(VLOOKUP($B57,'2017 marathon & half'!$B$16:$D$34,3,FALSE),\"\")","v":""},{"$f":"IFERROR(VLOOKUP($B57,'2017 marathon & half'!$B$37:$D$52,3,FALSE),\"\")","v":""},13,13,1,13,"","","","",1]
[]
[]
[1,"2017-03-19","Bradford 10k"]
[2,"May","Esholt 5k Series (x3)"]
[3,"2017-06-08","Bronte 5m"]
[4,"2017-07-05","Helen Windsor 10K "]
[5,"2017-08-03","UAK Track 1M "]
[6,"2017-08-19","Burnsall 10M "]
[7,"2017-10-29","Holmfirth 10K "]
[8,null,"Best ½ Marathon "]
[9,null,"Best Marathon "]

{"sheet":"2017 marathon & half","index":6,"n_rows":60,"n_cols":15,"rows_kept":60,"cut":false,"hidden":false,"merged":[]}
["Half Marathon Results",null,null,null,null,null,"Name","Fastest","Central Lancs","Wilmslow","Inskip","Oulton Park","Hastings","Keswick","Fleet"]
["Position","Name","Time","Points","in Road tbl","In Overall","John-Paul Hopkinson",{"$f":"MIN(I2:S2)","v":84.24},null,null,84.24]
[{"$f":"RANK(C3,$C$3:$C$13,1)","v":1},"John-Paul Hopkinson",{"$f":"VLOOKUP(B3,G:H,2,FALSE)","v":84.24},{"$f":"26-A3","v":25},{"$f":"VLOOKUP(B3,'2017 Road Table'!$B$3:$B$69,1,FALSE)","v":"John-Paul Hopkinson"},{"$f":"VLOOKUP(B3,'Overall Champs'!$C$7:$C$47,1,FALSE)","v":"John-Paul Hopkinson"},"Tracey Hodgson",{"$f":"MIN(I3:S3)","v":116.48},null,null,116.48,null,null,{"$f":"(2*60+4)","v":124}]
[{"$f":"RANK(C4,$C$3:$C$13,1)","v":2},"Tony Booth",{"$f":"VLOOKUP(B4,G:H,2,FALSE)","v":85.59},{"$f":"26-A4","v":24},{"$f":"VLOOKUP(B4,'2017 Road Table'!$B$3:$B$69,1,FALSE)","v":"Tony Booth"},{"$f":"VLOOKUP(B4,'Overall Champs'!$C$7:$C$47,1,FALSE)","v":"Tony Booth"},"Lorraine Bamfield",147.41,null,null,147.41]
[{"$f":"RANK(C5,$C$3:$C$13,1)","v":3},"John Conroy",{"$f":"VLOOKUP(B5,G:H,2,FALSE)","v":89.54},{"$f":"26-A5","v":23},{"$f":"VLOOKUP(B5,'2017 Road Table'!$B$3:$B$69,1,FALSE)","v":"John Conroy"},{"$f":"VLOOKUP(B5,'Overall Champs'!$C$7:$C$47,1,FALSE)","v":"John Conroy"},"Joe Atherton",92.32,null,92.32]
[{"$f":"RANK(C6,$C$3:$C$13,1)","v":4},"Joe Atherton",{"$f":"VLOOKUP(B6,G:H,2,FALSE)","v":92.32},{"$f":"26-A6","v":22},{"$f":"VLOOKUP(B6,'2017 Road Table'!$B$3:$B$69,1,FALSE)","v":"Joe Atherton"},{"$f":"VLOOKUP(B6,'Overall Champs'!$C$7:$C$47,1,FALSE)","v":"Joe Atherton"},"Donna Chester",113.29,113.29]
[null,null,null,null,null,null,"Hannah Yates",113.27,113.27]
[null,null,null,null,null,null,"John Conroy",89.54,null,null,null,null,null,null,89.54]
[null,null,null,null,null,null,"Heather Crow",134.56,null,null,null,null,134.56]
[null,null,null,null,null,null,"Tony Booth",85.59,null,null,null,85.59]
[null,null,null,null,null,null,"Sue Straw",101.12,null,null,null,101.12]
[]
[]
[]
["Position","Name ","Time","Points","in Road tbl","In Overall"]
[{"$f":"RANK(C16,$C$16:$C$22,1)","v":1},"Sue Straw",{"$f":"VLOOKUP(B16,G:H,2,FALSE)","v":101.12},{"$f":"26-A16","v":25},{"$f":"VLOOKUP(B16,'2017 Road Table'!$B$3:$B$69,1,FALSE)","v":"Sue Straw"},{"$f":"VLOOKUP(B16,'Overall Champs'!$O$7:$O$37,1,FALSE)","v":"Sue Straw"}]
[2,"Hannah Yates",113.27,24,{"$f":"VLOOKUP(B17,'2017 Road Table'!$B$3:$B$69,1,FALSE)","v":"Hannah Yates"},{"$f":"VLOOKUP(B17,'Overall Champs'!$O$7:$O$37,1,FALSE)","v":"Hannah Yates"}]
[3,"Donna Chester",113.29,23,{"$f":"VLOOKUP(B18,'2017 Road Table'!$B$3:$B$69,1,FALSE)","v":"Donna Chester"},{"$f":"VLOOKUP(B18,'Overall Champs'!$O$7:$O$37,1,FALSE)","v":"Donna Chester"}]
[4,"Tracey Hodgson",116.48,22,{"$f":"VLOOKUP(B19,'2017 Road Table'!$B$3:$B$69,1,FALSE)","v":"Tracey Hodgson"},{"$f":"VLOOKUP(B19,'Overall Champs'!$O$7:$O$37,1,FALSE)","v":"Tracey Hodgson"}]
[5,"Heather Crow",134.56,21,{"$f":"VLOOKUP(B20,'2017 Road Table'!$B$3:$B$69,1,FALSE)","v":"Heather Crow"},{"$f":"VLOOKUP(B20,'Overall Champs'!$O$7:$O$37,1,FALSE)","v":"Heather Crow"}]
[6,"Lorraine Bamfield",147.41,20,{"$f":"VLOOKUP(B21,'2017 Road Table'!$B$3:$B$69,1,FALSE)","v":"Lorraine Bamfield"},{"$f":"VLOOKUP(B21,'Overall Champs'!$O$7:$O$37,1,FALSE)","v":"Lorraine Bamfield"}]
[]
[]
[]
[" Marathon Results",null,null,null,null,null,"Name","Fastest","London","York","Paris"]
["Position","Name","Time","Points","in Road tbl","In Overall","Amanda Sterling",{"$f":"MIN(I26:S26)","v":215.37},null,null,{"$f":"(3*60+35+0.37)","v":215.37}]
[1,"gary chapman",{"$f":"VLOOKUP(B27,G$26:H$1048576,2,FALSE)","v":192},{"$f":"26-A27","v":25},{"$f":"VLOOKUP(B27,'2017 Road Table'!$B$3:$B$69,1,FALSE)","v":"Gary Chapman"},{"$f":"VLOOKUP(B27,'Overall Champs'!$C$7:$C$77,1,FALSE)","v":"Gary Chapman"},"gary chapman",{"$f":"MIN(I27:S27)","v":192},192]
[2,"Tony booth",{"$f":"VLOOKUP(B28,G$26:H$1048576,2,FALSE)","v":194},{"$f":"26-A28","v":24},{"$f":"VLOOKUP(B28,'2017 Road Table'!$B$3:$B$69,1,FALSE)","v":"Tony Booth"},{"$f":"VLOOKUP(B28,'Overall Champs'!$O$7:$O$74,1,FALSE)","v":{"$error":"#N/A"}},"Claire Cooper",193,193]
[3,"craig cooper",196,{"$f":"26-A29","v":23},{"$f":"VLOOKUP(B29,'2017 Road Table'!$B$3:$B$69,1,FALSE)","v":"Craig Cooper"},{"$f":"VLOOKUP(B29,'Overall Champs'!$O$7:$O$74,1,FALSE)","v":{"$error":"#N/A"}},"Tony booth",194,194]
[4,"Simon smallwood",274,{"$f":"26-A30","v":22},{"$f":"VLOOKUP(B30,'2017 Road Table'!$B$3:$B$69,1,FALSE)","v":"Simon Smallwood"},{"$f":"VLOOKUP(B30,'Overall Champs'!$O$7:$O$74,1,FALSE)","v":{"$error":"#N/A"}},"craig cooper",196,196]
[null,null,{"$error":"#N/A"},null,null,null,"sue straw",229,229]
[null,null,{"$error":"#N/A"},null,null,null,"Simon smallwood",274,274]
[null,null,{"$error":"#N/A"},null,null,null,"hannah yates",276,276]
[null,null,null,null,null,null,"lorraine bamfield",314,314]
[null,null,null,null,null,null,"samantha knowles",351,351]
[]
[]
[]
[]
["Position","Name ","Time","Points","in Road tbl","In Overall"]
[1,"Claire Cooper",{"$f":"VLOOKUP(B41,G$26:H$1048576,2,FALSE)","v":193},{"$f":"26-A41","v":25},{"$f":"VLOOKUP(B41,'2017 Road Table'!$B$3:$B$69,1,FALSE)","v":"Claire Cooper"},{"$f":"VLOOKUP(B41,'Overall Champs'!$O$7:$O$37,1,FALSE)","v":"Claire Cooper"}]
[2,"Amanda Sterling",{"$f":"VLOOKUP(B42,G$26:H$1048576,2,FALSE)","v":215.37},{"$f":"26-A42","v":24},{"$f":"VLOOKUP(B42,'2017 Road Table'!$B$3:$B$69,1,FALSE)","v":"Amanda Sterling"},{"$f":"VLOOKUP(B42,'Overall Champs'!$O$7:$O$37,1,FALSE)","v":"Amanda Sterling"}]
[3,"sue straw",{"$f":"VLOOKUP(B43,G$26:H$1048576,2,FALSE)","v":229},{"$f":"26-A43","v":23},{"$f":"VLOOKUP(B43,'2017 Road Table'!$B$3:$B$69,1,FALSE)","v":"Sue Straw"},{"$f":"VLOOKUP(B43,'Overall Champs'!$O$7:$O$37,1,FALSE)","v":"Sue Straw"}]
[4,"hannah yates",{"$f":"VLOOKUP(B44,G$26:H$1048576,2,FALSE)","v":276},{"$f":"26-A44","v":22},{"$f":"VLOOKUP(B44,'2017 Road Table'!$B$3:$B$69,1,FALSE)","v":"Hannah Yates"},{"$f":"VLOOKUP(B44,'Overall Champs'!$O$7:$O$37,1,FALSE)","v":"Hannah Yates"}]
[5,"lorraine bamfield",{"$f":"VLOOKUP(B45,G$26:H$1048576,2,FALSE)","v":314},{"$f":"26-A45","v":21},{"$f":"VLOOKUP(B45,'2017 Road Table'!$B$3:$B$69,1,FALSE)","v":"Lorraine Bamfield"},{"$f":"VLOOKUP(B45,'Overall Champs'!$O$7:$O$37,1,FALSE)","v":"Lorraine Bamfield"}]
[6,"samantha knowles",{"$f":"VLOOKUP(B46,G$26:H$1048576,2,FALSE)","v":351},20,{"$f":"VLOOKUP(B46,'2017 Road Table'!$B$3:$B$69,1,FALSE)","v":"Samantha Knowles"},{"$f":"VLOOKUP(B46,'Overall Champs'!$O$7:$O$37,1,FALSE)","v":"Samantha Knowles"}]
[]
[]
[]
[]
[]
[null,null,null,null,null,null,null,null,"» Chapman, Gary (GBR)",{"$f":"3*60+12","v":192},"05:14:36"]
[null,null,null,null,null,null,null,null,"» Cooper, Claire (GBR)",{"$f":"3*60+13","v":193},"03:14:25"]
[null,null,null,null,null,null,null,null,"» Booth, Tony (GBR)",{"$f":"3*60+14","v":194},"03:12:11"]
[null,null,null,null,null,null,null,null,"» Cooper, Craig (GBR)",{"$f":"3*60+16","v":196},"03:13:06"]
[null,null,null,null,null,null,null,null,"» Straw, Sue (GBR)",{"$f":"3*60+49","v":229},"03:16:00"]
[null,null,null,null,null,null,null,null,"» Smallwood, Robert (GBR)",{"$f":"4*60+34","v":274},"05:51:56"]
[null,null,null,null,null,null,null,null,"» Yates, Hannah (ENG)",{"$f":"4*60+36","v":276},"04:34:25"]
[null,null,null,null,null,null,null,null,"» Bamfield, Lorraine (GBR)",{"$f":"(5*60+14)","v":314},"03:49:14"]
[null,null,null,null,null,null,null,null,"» Knowles, Samantha (GBR)",{"$f":"5*60+51","v":351},"04:36:09"]

{"sheet":"2017 extreme results","index":7,"n_rows":87,"n_cols":11,"rows_kept":87,"cut":false,"hidden":false,"merged":[]}
["Race 1 ","Rombalds"]
["Position","Name","lookup","Points","overall champs lookup","overall champs lookup","Club","Cat","Time","Comment ","overall champs lookup"]
[1,"John-Paul Hopkinson",{"$f":"VLOOKUP(B3,'2017 extreme Table'!$B$3:$B$76,1,FALSE)","v":"John-Paul Hopkinson"},{"$f":"26-A3","v":25},{"$f":"VLOOKUP(B3,'Overall Champs'!C:C,1,FALSE)","v":"John-Paul Hopkinson"},{"$f":"VLOOKUP(B3,'Overall Champs'!O:O,1,FALSE)","v":{"$error":"#N/A"}},null,null,"03:18:18"]
[2,"Richard Butter",{"$f":"VLOOKUP(B4,'2017 extreme Table'!$B$3:$B$76,1,FALSE)","v":{"$error":"#N/A"}},{"$f":"26-A4","v":24},{"$f":"VLOOKUP(B4,'Overall Champs'!C:C,1,FALSE)","v":"Richard Butter"},{"$f":"VLOOKUP(B4,'Overall Champs'!O:O,1,FALSE)","v":{"$error":"#N/A"}},null,null,"03:40:08"]
[3,"Dick Ballantine",{"$f":"VLOOKUP(B5,'2017 extreme Table'!$B$3:$B$76,1,FALSE)","v":"Dick Ballantine"},23,{"$f":"VLOOKUP(B5,'Overall Champs'!C:C,1,FALSE)","v":"Dick Ballantine"},{"$f":"VLOOKUP(B5,'Overall Champs'!O:O,1,FALSE)","v":{"$error":"#N/A"}},null,null,"03:49:43"]
[4,"Simon Bellwood ",{"$f":"VLOOKUP(B6,'2017 extreme Table'!$B$3:$B$76,1,FALSE)","v":"Simon Bellwood "},22,{"$f":"VLOOKUP(B6,'Overall Champs'!C:C,1,FALSE)","v":"Simon Bellwood "},{"$f":"VLOOKUP(B6,'Overall Champs'!O:O,1,FALSE)","v":{"$error":"#N/A"}},null,null,"03:59:57"]
[5,"Russell Fairhurst",{"$f":"VLOOKUP(B7,'2017 extreme Table'!$B$3:$B$76,1,FALSE)","v":"Russell Fairhurst"},21,{"$f":"VLOOKUP(B7,'Overall Champs'!C:C,1,FALSE)","v":"Russell Fairhurst"},{"$f":"VLOOKUP(B7,'Overall Champs'!O:O,1,FALSE)","v":{"$error":"#N/A"}},null,null,"03:59:57"]
[6,"Simon Wheeler",{"$f":"VLOOKUP(B8,'2017 extreme Table'!$B$3:$B$76,1,FALSE)","v":"Simon Wheeler"},20,{"$f":"VLOOKUP(B8,'Overall Champs'!C:C,1,FALSE)","v":"Simon Wheeler"},{"$f":"VLOOKUP(B8,'Overall Champs'!O:O,1,FALSE)","v":{"$error":"#N/A"}},null,null,"04:00:14"]
[7,"Steve Carter ",{"$f":"VLOOKUP(B9,'2017 extreme Table'!$B$3:$B$76,1,FALSE)","v":"Steve Carter "},19,{"$f":"VLOOKUP(B9,'Overall Champs'!C:C,1,FALSE)","v":"Steve Carter "},{"$f":"VLOOKUP(B9,'Overall Champs'!O:O,1,FALSE)","v":{"$error":"#N/A"}},null,null,"04:37:28"]
[1,"Diane Macdonald",{"$f":"VLOOKUP(B10,'2017 extreme Table'!$B$3:$B$76,1,FALSE)","v":"Diane Macdonald"},25,{"$f":"VLOOKUP(B10,'Overall Champs'!C:C,1,FALSE)","v":{"$error":"#N/A"}},{"$f":"VLOOKUP(B10,'Overall Champs'!O:O,1,FALSE)","v":"Diane Macdonald"},null,null,"04:43:34"]
[8,"Ian Rodgers",{"$f":"VLOOKUP(B11,'2017 extreme Table'!$B$3:$B$76,1,FALSE)","v":"Ian Rodgers"},18,{"$f":"VLOOKUP(B11,'Overall Champs'!C:C,1,FALSE)","v":"Ian Rodgers"},{"$f":"VLOOKUP(B11,'Overall Champs'!O:O,1,FALSE)","v":{"$error":"#N/A"}},null,null,"04:43:34"]
[2,"Hannah Yates",{"$f":"VLOOKUP(B12,'2017 extreme Table'!$B$3:$B$76,1,FALSE)","v":"Hannah Yates"},24,{"$f":"VLOOKUP(B12,'Overall Champs'!C:C,1,FALSE)","v":{"$error":"#N/A"}},{"$f":"VLOOKUP(B12,'Overall Champs'!O:O,1,FALSE)","v":"Hannah Yates"},null,null,"05:11:20"]
[3,"Donna Chester",{"$f":"VLOOKUP(B13,'2017 extreme Table'!$B$3:$B$76,1,FALSE)","v":"Donna Chester"},23,{"$f":"VLOOKUP(B13,'Overall Champs'!C:C,1,FALSE)","v":{"$error":"#N/A"}},{"$f":"VLOOKUP(B13,'Overall Champs'!O:O,1,FALSE)","v":"Donna Chester"},null,null,"05:11:45"]
[4,"Victoria Wadsworth ",{"$f":"VLOOKUP(B14,'2017 extreme Table'!$B$3:$B$76,1,FALSE)","v":"Victoria Wadsworth "},22,{"$f":"VLOOKUP(B14,'Overall Champs'!C:C,1,FALSE)","v":{"$error":"#N/A"}},{"$f":"VLOOKUP(B14,'Overall Champs'!O:O,1,FALSE)","v":"Victoria Wadsworth "},null,null,"05:13:00"]
[9,"Alistair Gavins ",{"$f":"VLOOKUP(B15,'2017 extreme Table'!$B$3:$B$76,1,FALSE)","v":"Alistair Gavins "},17,{"$f":"VLOOKUP(B15,'Overall Champs'!C:C,1,FALSE)","v":"Alistair Gavins "},{"$f":"VLOOKUP(B15,'Overall Champs'!O:O,1,FALSE)","v":{"$error":"#N/A"}},null,null,"05:13:12"]
[]
[]
[]
[]
["Race 2","3 peaks"]
["Position","Name","ext table check","Points","overall champs check",null,"Club","Cat","Time","Comment "]
[1,"Christopher Loftus",{"$f":"VLOOKUP(B22,'2017 extreme Table'!$B$3:$B$76,1,FALSE)","v":"Christopher Loftus"},{"$f":"26-A22","v":25},{"$f":"VLOOKUP(B22,'Overall Champs'!C:C,1,FALSE)","v":"Christopher Loftus"},null,"Keithley ","M40","1.13.15"]
[2,"Sam Downey",{"$f":"VLOOKUP(B23,'2017 extreme Table'!$B$3:$B$76,1,FALSE)","v":"Sam Downey"},{"$f":"26-A23","v":24},{"$f":"VLOOKUP(B23,'Overall Champs'!C:C,1,FALSE)","v":"Sam Downey"},null,"Keithley ","M40","1.13.47"]
[3,"Shaun Wilkinson",{"$f":"VLOOKUP(B24,'2017 extreme Table'!$B$3:$B$76,1,FALSE)","v":"Shaun Wilkinson"},23,{"$f":"VLOOKUP(B24,'Overall Champs'!C:C,1,FALSE)","v":"Shaun Wilkinson"},null,"Keithley ","M40","1.15.22"]
[4,"Ben Timbers",{"$f":"VLOOKUP(B25,'2017 extreme Table'!$B$3:$B$76,1,FALSE)","v":"Ben Timbers"},22,{"$f":"VLOOKUP(B25,'Overall Champs'!C:C,1,FALSE)","v":"Ben Timbers"},null,"Keithley ","M40","1.19.09"]
[5,"Rick Harwood",{"$f":"VLOOKUP(B26,'2017 extreme Table'!$B$3:$B$76,1,FALSE)","v":"Rick Harwood"},21,{"$f":"VLOOKUP(B26,'Overall Champs'!C:C,1,FALSE)","v":"Rick Harwood"},null,"Keithley ","M50","1.20.46"]
[6,"John Conroy",{"$f":"VLOOKUP(B27,'2017 extreme Table'!$B$3:$B$76,1,FALSE)","v":"John Conroy"},20,{"$f":"VLOOKUP(B27,'Overall Champs'!C:C,1,FALSE)","v":"John Conroy"},null,"Keithley ","M Senior","1.21.19"]
[7,"Peter Lloyd",{"$f":"VLOOKUP(B28,'2017 extreme Table'!$B$3:$B$76,1,FALSE)","v":"Peter Lloyd"},19,{"$f":"VLOOKUP(B28,'Overall Champs'!C:C,1,FALSE)","v":"Peter Lloyd"},null,"Keithley ","M40","1.30.48"]
[8,"Russell Aydon-Butler",{"$f":"VLOOKUP(B29,'2017 extreme Table'!$B$3:$B$76,1,FALSE)","v":"Russell Aydon-Butler"},18,{"$f":"VLOOKUP(B29,'Overall Champs'!C:C,1,FALSE)","v":"Russell Aydon-Butler"},null,"Keithley ","F Senior","1.33.17","1st F Senior"]
[9,"David Copping",{"$f":"VLOOKUP(B30,'2017 extreme Table'!$B$3:$B$76,1,FALSE)","v":"David Copping"},17,{"$f":"VLOOKUP(B30,'Overall Champs'!C:C,1,FALSE)","v":"David Copping"},null,"Keithley ","F50","1.37.04","1st  F50"]
[10,"Andrew Travis",{"$f":"VLOOKUP(B31,'2017 extreme Table'!$B$3:$B$76,1,FALSE)","v":"Andrew Travis"},16,{"$f":"VLOOKUP(B31,'Overall Champs'!C:C,1,FALSE)","v":"Andrew Travis"},null,"Keithley ","F Senior","1.48.21"]
[11,"Peter Smith",{"$f":"VLOOKUP(B32,'2017 extreme Table'!$B$3:$B$76,1,FALSE)","v":"Peter Smith"},15,{"$f":"VLOOKUP(B32,'Overall Champs'!C:C,1,FALSE)","v":"Peter Smith"}]
[12,"Russell Fairhurst",{"$f":"VLOOKUP(B33,'2017 extreme Table'!$B$3:$B$76,1,FALSE)","v":"Russell Fairhurst"},14,{"$f":"VLOOKUP(B33,'Overall Champs'!C:C,1,FALSE)","v":"Russell Fairhurst"}]
[13,"Dan Timbers",{"$f":"VLOOKUP(B34,'2017 extreme Table'!$B$3:$B$76,1,FALSE)","v":"Dan Timbers"},13,{"$f":"VLOOKUP(B34,'Overall Champs'!C:C,1,FALSE)","v":"Dan Timbers"}]
[14,"Dick Ballantine",{"$f":"VLOOKUP(B35,'2017 extreme Table'!$B$3:$B$76,1,FALSE)","v":"Dick Ballantine"},12,{"$f":"VLOOKUP(B35,'Overall Champs'!C:C,1,FALSE)","v":"Dick Ballantine"}]
[15,"Tim Thom",{"$f":"VLOOKUP(B36,'2017 extreme Table'!$B$3:$B$76,1,FALSE)","v":"Tim Thom"},11,{"$f":"VLOOKUP(B36,'Overall Champs'!C:C,1,FALSE)","v":"Tim Thom"}]
[16,"Simon Wheeler",{"$f":"VLOOKUP(B37,'2017 extreme Table'!$B$3:$B$76,1,FALSE)","v":"Simon Wheeler"},10,{"$f":"VLOOKUP(B37,'Overall Champs'!C:C,1,FALSE)","v":"Simon Wheeler"}]
[1,"Angela Paxton",{"$f":"VLOOKUP(B38,'2017 extreme Table'!$B$3:$B$76,1,FALSE)","v":"Angela Paxton"},{"$f":"26-A38","v":25},null,{"$f":"VLOOKUP(B38,'Overall Champs'!O:O,1,FALSE)","v":"Angela Paxton"}]
[2,"Sharon Hudson",{"$f":"VLOOKUP(B39,'2017 extreme Table'!$B$3:$B$76,1,FALSE)","v":"Sharon Hudson"},24,null,{"$f":"VLOOKUP(B39,'Overall Champs'!O:O,1,FALSE)","v":"Sharon Hudson"}]
[3,"Amanda Sterling",{"$f":"VLOOKUP(B40,'2017 extreme Table'!$B$3:$B$76,1,FALSE)","v":"Amanda Sterling"},23,null,{"$f":"VLOOKUP(B40,'Overall Champs'!O:O,1,FALSE)","v":"Amanda Sterling"}]
[4,"Hannah Thom",{"$f":"VLOOKUP(B41,'2017 extreme Table'!$B$3:$B$76,1,FALSE)","v":"Hannah Thom"},22,null,{"$f":"VLOOKUP(B41,'Overall Champs'!O:O,1,FALSE)","v":"Hannah Thom"}]
[]
[]
["Race 3",null,null,"Points"]
["Position",null,{"$f":"VLOOKUP(B34,#REF!,1,FALSE)","v":{"$error":"#REF!"}},{"$f":"26-A46","v":25}]
[1,null,{"$f":"VLOOKUP(B35,#REF!,1,FALSE)","v":{"$error":"#REF!"}},{"$f":"26-A47","v":24}]
[2,null,{"$f":"VLOOKUP(B36,#REF!,1,FALSE)","v":{"$error":"#REF!"}},23]
[3,null,{"$f":"VLOOKUP(B37,#REF!,1,FALSE)","v":{"$error":"#REF!"}},22]
[4,null,{"$f":"VLOOKUP(B42,#REF!,1,FALSE)","v":{"$error":"#REF!"}},25]
[1,null,{"$f":"VLOOKUP(B43,#REF!,1,FALSE)","v":{"$error":"#REF!"}},21]
[5,"Race 4",{"$f":"VLOOKUP(B44,#REF!,1,FALSE)","v":{"$error":"#REF!"}},20]
[6,"Name",{"$f":"VLOOKUP(B45,#REF!,1,FALSE)","v":{"$error":"#REF!"}},24]
[2,null,{"$f":"VLOOKUP(B46,#REF!,1,FALSE)","v":{"$error":"#REF!"}},23]
[3,null,{"$f":"VLOOKUP(B47,#REF!,1,FALSE)","v":{"$error":"#REF!"}},22]
[4,null,{"$f":"VLOOKUP(B48,#REF!,1,FALSE)","v":{"$error":"#REF!"}},19]
[7,null,{"$f":"VLOOKUP(B49,#REF!,1,FALSE)","v":{"$error":"#REF!"}},21]
[5]
[]
["Race 4",null,null,"Points"]
["Position",null,{"$f":"VLOOKUP(B53,#REF!,1,FALSE)","v":{"$error":"#REF!"}},{"$f":"26-A61","v":25}]
[1,null,{"$f":"VLOOKUP(B54,#REF!,1,FALSE)","v":{"$error":"#REF!"}},{"$f":"26-A62","v":24}]
[2,null,{"$f":"VLOOKUP(B55,#REF!,1,FALSE)","v":{"$error":"#REF!"}},23]
[3,null,{"$f":"VLOOKUP(B56,#REF!,1,FALSE)","v":{"$error":"#REF!"}},22]
[4,null,{"$f":"VLOOKUP(B57,#REF!,1,FALSE)","v":{"$error":"#REF!"}},25]
[1,null,{"$f":"VLOOKUP(B58,#REF!,1,FALSE)","v":{"$error":"#REF!"}},21]
[5,null,{"$f":"VLOOKUP(B59,#REF!,1,FALSE)","v":{"$error":"#REF!"}},20]
[6,"Name",{"$f":"VLOOKUP(B60,#REF!,1,FALSE)","v":{"$error":"#REF!"}},24]
[2,null,{"$f":"VLOOKUP(B61,#REF!,1,FALSE)","v":{"$error":"#REF!"}},23]
[3,null,{"$f":"VLOOKUP(B62,#REF!,1,FALSE)","v":{"$error":"#REF!"}},22]
[4,null,{"$f":"VLOOKUP(B63,#REF!,1,FALSE)","v":{"$error":"#REF!"}},19]
[7,null,{"$f":"VLOOKUP(B64,#REF!,1,FALSE)","v":{"$error":"#REF!"}},21]
[5]
[]
["Race 5",null,null,"Points"]
["Position",null,{"$f":"VLOOKUP(B68,#REF!,1,FALSE)","v":{"$error":"#REF!"}},{"$f":"26-A76","v":25}]
[1,null,{"$f":"VLOOKUP(B69,#REF!,1,FALSE)","v":{"$error":"#REF!"}},{"$f":"26-A77","v":24}]
[2,null,{"$f":"VLOOKUP(B70,#REF!,1,FALSE)","v":{"$error":"#REF!"}},23]
[3,null,{"$f":"VLOOKUP(B71,#REF!,1,FALSE)","v":{"$error":"#REF!"}},22]
[4,null,{"$f":"VLOOKUP(B72,#REF!,1,FALSE)","v":{"$error":"#REF!"}},25]
[1,null,{"$f":"VLOOKUP(B73,#REF!,1,FALSE)","v":{"$error":"#REF!"}},21]
[5,null,{"$f":"VLOOKUP(B74,#REF!,1,FALSE)","v":{"$error":"#REF!"}},20]
[6,null,{"$f":"VLOOKUP(B75,#REF!,1,FALSE)","v":{"$error":"#REF!"}},24]
[2,null,{"$f":"VLOOKUP(B76,#REF!,1,FALSE)","v":{"$error":"#REF!"}},23]
[3,null,{"$f":"VLOOKUP(B77,#REF!,1,FALSE)","v":{"$error":"#REF!"}},22]
[4,null,{"$f":"VLOOKUP(B78,#REF!,1,FALSE)","v":{"$error":"#REF!"}},19]
[7,null,{"$f":"VLOOKUP(B79,#REF!,1,FALSE)","v":{"$error":"#REF!"}},21]
[5]

{"sheet":"2017 fell results","index":8,"n_rows":138,"n_cols":6,"rows_kept":138,"cut":false,"hidden":false,"merged":[]}
["Race 1 Hoofstones","Hoofstones"]
["Position","Name",null,"Points","overall champs lookup male","overall champs lookup female"]
[1,"John-Paul Hopkinson",{"$f":"VLOOKUP(B3,'2017 fell Table'!$B$3:$B$61,1,FALSE)","v":"John-Paul Hopkinson"},{"$f":"26-A3","v":25},{"$f":"VLOOKUP(B3,'Overall Champs'!C:C,1,FALSE)","v":"John-Paul Hopkinson"},{"$f":"VLOOKUP(B3,'Overall Champs'!O:O,1,FALSE)","v":{"$error":"#N/A"}}]
[2,"Ian Willis",{"$f":"VLOOKUP(B4,'2017 fell Table'!$B$3:$B$61,1,FALSE)","v":"Ian Willis"},{"$f":"26-A4","v":24},{"$f":"VLOOKUP(B4,'Overall Champs'!C:C,1,FALSE)","v":"Ian Willis"},{"$f":"VLOOKUP(B4,'Overall Champs'!O:O,1,FALSE)","v":{"$error":"#N/A"}}]
[3,"Alfie Walker",{"$f":"VLOOKUP(B5,'2017 fell Table'!$B$3:$B$61,1,FALSE)","v":"Alfie Walker"},23,{"$f":"VLOOKUP(B5,'Overall Champs'!C:C,1,FALSE)","v":"Alfie Walker"},{"$f":"VLOOKUP(B5,'Overall Champs'!O:O,1,FALSE)","v":{"$error":"#N/A"}}]
[4,"Paul Crabtree",{"$f":"VLOOKUP(B6,'2017 fell Table'!$B$3:$B$61,1,FALSE)","v":"Paul Crabtree"},22,{"$f":"VLOOKUP(B6,'Overall Champs'!C:C,1,FALSE)","v":"Paul Crabtree"},{"$f":"VLOOKUP(B6,'Overall Champs'!O:O,1,FALSE)","v":{"$error":"#N/A"}}]
[5,"Dave Copping",{"$f":"VLOOKUP(B7,'2017 fell Table'!$B$3:$B$61,1,FALSE)","v":{"$error":"#N/A"}},21,{"$f":"VLOOKUP(B7,'Overall Champs'!C:C,1,FALSE)","v":"Dave Copping"},{"$f":"VLOOKUP(B7,'Overall Champs'!O:O,1,FALSE)","v":{"$error":"#N/A"}}]
[6,"Peter Lloyd",{"$f":"VLOOKUP(B8,'2017 fell Table'!$B$3:$B$61,1,FALSE)","v":"Peter Lloyd"},20,{"$f":"VLOOKUP(B8,'Overall Champs'!C:C,1,FALSE)","v":"Peter Lloyd"},{"$f":"VLOOKUP(B8,'Overall Champs'!O:O,1,FALSE)","v":{"$error":"#N/A"}}]
[7,"Richard Butter",{"$f":"VLOOKUP(B9,'2017 fell Table'!$B$3:$B$61,1,FALSE)","v":"Richard Butter"},19,{"$f":"VLOOKUP(B9,'Overall Champs'!C:C,1,FALSE)","v":"Richard Butter"},{"$f":"VLOOKUP(B9,'Overall Champs'!O:O,1,FALSE)","v":{"$error":"#N/A"}}]
[1,"Hannah Thom",{"$f":"VLOOKUP(B10,'2017 fell Table'!$B$3:$B$61,1,FALSE)","v":"Hannah Thom"},25,{"$f":"VLOOKUP(B10,'Overall Champs'!C:C,1,FALSE)","v":{"$error":"#N/A"}},{"$f":"VLOOKUP(B10,'Overall Champs'!O:O,1,FALSE)","v":"Hannah Thom"}]
[8,"Tim Thom",{"$f":"VLOOKUP(B11,'2017 fell Table'!$B$3:$B$61,1,FALSE)","v":"Tim Thom"},18,{"$f":"VLOOKUP(B11,'Overall Champs'!C:C,1,FALSE)","v":"Tim Thom"},{"$f":"VLOOKUP(B11,'Overall Champs'!O:O,1,FALSE)","v":{"$error":"#N/A"}}]
[2,"Hilary Barber",{"$f":"VLOOKUP(B12,'2017 fell Table'!$B$3:$B$61,1,FALSE)","v":"Hilary Barber"},24,{"$f":"VLOOKUP(B12,'Overall Champs'!C:C,1,FALSE)","v":{"$error":"#N/A"}},{"$f":"VLOOKUP(B12,'Overall Champs'!O:O,1,FALSE)","v":"Hilary Barber"}]
[9,"Paul Sessford",{"$f":"VLOOKUP(B13,'2017 fell Table'!$B$3:$B$61,1,FALSE)","v":"Paul Sessford"},17,{"$f":"VLOOKUP(B13,'Overall Champs'!C:C,1,FALSE)","v":"Paul Sessford"},{"$f":"VLOOKUP(B13,'Overall Champs'!O:O,1,FALSE)","v":{"$error":"#N/A"}}]
[3,"Tracey Hodgson",{"$f":"VLOOKUP(B14,'2017 fell Table'!$B$3:$B$61,1,FALSE)","v":"Tracey Hodgson"},23,{"$f":"VLOOKUP(B14,'Overall Champs'!C:C,1,FALSE)","v":{"$error":"#N/A"}},{"$f":"VLOOKUP(B14,'Overall Champs'!O:O,1,FALSE)","v":"Tracey Hodgson"}]
[null,null,null,null,{"$f":"VLOOKUP(B15,'Overall Champs'!C:C,1,FALSE)","v":{"$error":"#N/A"}},{"$f":"VLOOKUP(B15,'Overall Champs'!O:O,1,FALSE)","v":{"$error":"#N/A"}}]
["Race 2","Bleasdale"]
["Position","Name",null,"Points"]
[1,"Ian Willis",{"$f":"VLOOKUP(B18,'2017 fell Table'!$B$3:$B$61,1,FALSE)","v":"Ian Willis"},{"$f":"26-A18","v":25},{"$f":"VLOOKUP(B18,'Overall Champs'!C:C,1,FALSE)","v":"Ian Willis"},{"$f":"VLOOKUP(B18,'Overall Champs'!O:O,1,FALSE)","v":{"$error":"#N/A"}}]
[2,"John-Paul Hopkinson",{"$f":"VLOOKUP(B19,'2017 fell Table'!$B$3:$B$61,1,FALSE)","v":"John-Paul Hopkinson"},{"$f":"26-A19","v":24},{"$f":"VLOOKUP(B19,'Overall Champs'!C:C,1,FALSE)","v":"John-Paul Hopkinson"},{"$f":"VLOOKUP(B19,'Overall Champs'!O:O,1,FALSE)","v":{"$error":"#N/A"}}]
[3,"Paul Crabtree",{"$f":"VLOOKUP(B20,'2017 fell Table'!$B$3:$B$61,1,FALSE)","v":"Paul Crabtree"},23,{"$f":"VLOOKUP(B20,'Overall Champs'!C:C,1,FALSE)","v":"Paul Crabtree"},{"$f":"VLOOKUP(B20,'Overall Champs'!O:O,1,FALSE)","v":{"$error":"#N/A"}}]
[4,"Alfie Walker",{"$f":"VLOOKUP(B21,'2017 fell Table'!$B$3:$B$61,1,FALSE)","v":"Alfie Walker"},22,{"$f":"VLOOKUP(B21,'Overall Champs'!C:C,1,FALSE)","v":"Alfie Walker"},{"$f":"VLOOKUP(B21,'Overall Champs'!O:O,1,FALSE)","v":{"$error":"#N/A"}}]
[5,"Dave Evans",{"$f":"VLOOKUP(B22,'2017 fell Table'!$B$3:$B$61,1,FALSE)","v":"Dave Evans"},21,{"$f":"VLOOKUP(B22,'Overall Champs'!C:C,1,FALSE)","v":"Dave Evans"},{"$f":"VLOOKUP(B22,'Overall Champs'!O:O,1,FALSE)","v":{"$error":"#N/A"}}]
[6,"John Conroy",{"$f":"VLOOKUP(B23,'2017 fell Table'!$B$3:$B$61,1,FALSE)","v":"John Conroy"},20,{"$f":"VLOOKUP(B23,'Overall Champs'!C:C,1,FALSE)","v":"John Conroy"},{"$f":"VLOOKUP(B23,'Overall Champs'!O:O,1,FALSE)","v":{"$error":"#N/A"}}]
[7,"Peter Lloyd",{"$f":"VLOOKUP(B24,'2017 fell Table'!$B$3:$B$61,1,FALSE)","v":"Peter Lloyd"},19,{"$f":"VLOOKUP(B24,'Overall Champs'!C:C,1,FALSE)","v":"Peter Lloyd"},{"$f":"VLOOKUP(B24,'Overall Champs'!O:O,1,FALSE)","v":{"$error":"#N/A"}}]
[8,"Richard Butter",{"$f":"VLOOKUP(B25,'2017 fell Table'!$B$3:$B$61,1,FALSE)","v":"Richard Butter"},18,{"$f":"VLOOKUP(B25,'Overall Champs'!C:C,1,FALSE)","v":"Richard Butter"},{"$f":"VLOOKUP(B25,'Overall Champs'!O:O,1,FALSE)","v":{"$error":"#N/A"}}]
[1,"Hilary Barber",{"$f":"VLOOKUP(B26,'2017 fell Table'!$B$3:$B$61,1,FALSE)","v":"Hilary Barber"},25,{"$f":"VLOOKUP(B26,'Overall Champs'!C:C,1,FALSE)","v":{"$error":"#N/A"}},{"$f":"VLOOKUP(B26,'Overall Champs'!O:O,1,FALSE)","v":"Hilary Barber"}]
[2,"Tracey Hodgson",{"$f":"VLOOKUP(B27,'2017 fell Table'!$B$3:$B$61,1,FALSE)","v":"Tracey Hodgson"},24,{"$f":"VLOOKUP(B27,'Overall Champs'!C:C,1,FALSE)","v":{"$error":"#N/A"}},{"$f":"VLOOKUP(B27,'Overall Champs'!O:O,1,FALSE)","v":"Tracey Hodgson"}]
[9,"Richard Hindle",{"$f":"VLOOKUP(B28,'2017 fell Table'!$B$3:$B$61,1,FALSE)","v":"Richard Hindle"},17,{"$f":"VLOOKUP(B28,'Overall Champs'!C:C,1,FALSE)","v":"Richard Hindle"},{"$f":"VLOOKUP(B28,'Overall Champs'!O:O,1,FALSE)","v":{"$error":"#N/A"}}]
[9,null,{"$f":"VLOOKUP(B29,'2017 fell Table'!$B$3:$B$61,1,FALSE)","v":{"$error":"#N/A"}},17]
[4,null,{"$f":"VLOOKUP(B30,'2017 fell Table'!$B$3:$B$61,1,FALSE)","v":{"$error":"#N/A"}},22]
[5,null,{"$f":"VLOOKUP(B31,'2017 fell Table'!$B$3:$B$61,1,FALSE)","v":{"$error":"#N/A"}},21]
[]
["Race 3","Stan Bradshaw"]
["Position","Name",null,"Points"]
[1,"Scott Bairstow",{"$f":"VLOOKUP(B35,'2017 fell Table'!$B$3:$B$61,1,FALSE)","v":"Scott Bairstow"},{"$f":"26-A35","v":25},{"$f":"VLOOKUP(B35,'Overall Champs'!C:C,1,FALSE)","v":"Scott Bairstow"},{"$f":"VLOOKUP(B35,'Overall Champs'!O:O,1,FALSE)","v":{"$error":"#N/A"}}]
[2,"John-Paul Hopkinson",{"$f":"VLOOKUP(B36,'2017 fell Table'!$B$3:$B$61,1,FALSE)","v":"John-Paul Hopkinson"},{"$f":"26-A36","v":24},{"$f":"VLOOKUP(B36,'Overall Champs'!C:C,1,FALSE)","v":"John-Paul Hopkinson"},{"$f":"VLOOKUP(B36,'Overall Champs'!O:O,1,FALSE)","v":{"$error":"#N/A"}}]
[3,"Dave Evans",{"$f":"VLOOKUP(B37,'2017 fell Table'!$B$3:$B$61,1,FALSE)","v":"Dave Evans"},{"$f":"26-A37","v":23},{"$f":"VLOOKUP(B37,'Overall Champs'!C:C,1,FALSE)","v":"Dave Evans"},{"$f":"VLOOKUP(B37,'Overall Champs'!O:O,1,FALSE)","v":{"$error":"#N/A"}}]
[4,"Dave Copping",{"$f":"VLOOKUP(B38,'2017 fell Table'!$B$3:$B$61,1,FALSE)","v":{"$error":"#N/A"}},22,{"$f":"VLOOKUP(B38,'Overall Champs'!C:C,1,FALSE)","v":"Dave Copping"},{"$f":"VLOOKUP(B38,'Overall Champs'!O:O,1,FALSE)","v":{"$error":"#N/A"}}]
[5,"John Conroy",{"$f":"VLOOKUP(B39,'2017 fell Table'!$B$3:$B$61,1,FALSE)","v":"John Conroy"},21,{"$f":"VLOOKUP(B39,'Overall Champs'!C:C,1,FALSE)","v":"John Conroy"},{"$f":"VLOOKUP(B39,'Overall Champs'!O:O,1,FALSE)","v":{"$error":"#N/A"}}]
[6,"Richard Butter",{"$f":"VLOOKUP(B40,'2017 fell Table'!$B$3:$B$61,1,FALSE)","v":"Richard Butter"},{"$f":"26-A40","v":20},{"$f":"VLOOKUP(B40,'Overall Champs'!C:C,1,FALSE)","v":"Richard Butter"},{"$f":"VLOOKUP(B40,'Overall Champs'!O:O,1,FALSE)","v":{"$error":"#N/A"}}]
[1,"Lorna Hubbard",{"$f":"VLOOKUP(B41,'2017 fell Table'!$B$3:$B$61,1,FALSE)","v":"Lorna Hubbard"},25,{"$f":"VLOOKUP(B41,'Overall Champs'!C:C,1,FALSE)","v":{"$error":"#N/A"}},{"$f":"VLOOKUP(B41,'Overall Champs'!O:O,1,FALSE)","v":"Lorna Hubbard"}]
[2,"Hannah Thom",{"$f":"VLOOKUP(B42,'2017 fell Table'!$B$3:$B$61,1,FALSE)","v":"Hannah Thom"},24,{"$f":"VLOOKUP(B42,'Overall Champs'!C:C,1,FALSE)","v":{"$error":"#N/A"}},{"$f":"VLOOKUP(B42,'Overall Champs'!O:O,1,FALSE)","v":"Hannah Thom"}]
[7,"Simon Wheeler",{"$f":"VLOOKUP(B43,'2017 fell Table'!$B$3:$B$61,1,FALSE)","v":"Simon Wheeler"},19,{"$f":"VLOOKUP(B43,'Overall Champs'!C:C,1,FALSE)","v":"Simon Wheeler"},{"$f":"VLOOKUP(B43,'Overall Champs'!O:O,1,FALSE)","v":{"$error":"#N/A"}}]
[8,"Tim Thom",{"$f":"VLOOKUP(B44,'2017 fell Table'!$B$3:$B$61,1,FALSE)","v":"Tim Thom"},18,{"$f":"VLOOKUP(B44,'Overall Champs'!C:C,1,FALSE)","v":"Tim Thom"},{"$f":"VLOOKUP(B44,'Overall Champs'!O:O,1,FALSE)","v":{"$error":"#N/A"}}]
[3,"Tracey Hodgson",{"$f":"VLOOKUP(B45,'2017 fell Table'!$B$3:$B$61,1,FALSE)","v":"Tracey Hodgson"},23,{"$f":"VLOOKUP(B45,'Overall Champs'!C:C,1,FALSE)","v":{"$error":"#N/A"}},{"$f":"VLOOKUP(B45,'Overall Champs'!O:O,1,FALSE)","v":"Tracey Hodgson"}]
[9,"Richard Hindle",{"$f":"VLOOKUP(B46,'2017 fell Table'!$B$3:$B$61,1,FALSE)","v":"Richard Hindle"},17,{"$f":"VLOOKUP(B46,'Overall Champs'!C:C,1,FALSE)","v":"Richard Hindle"},{"$f":"VLOOKUP(B46,'Overall Champs'!O:O,1,FALSE)","v":{"$error":"#N/A"}}]
[4,"Emma Dooks",{"$f":"VLOOKUP(B47,'2017 fell Table'!$B$3:$B$61,1,FALSE)","v":"Emma Dooks"},22,{"$f":"VLOOKUP(B47,'Overall Champs'!C:C,1,FALSE)","v":{"$error":"#N/A"}},{"$f":"VLOOKUP(B47,'Overall Champs'!O:O,1,FALSE)","v":"Emma Dooks"}]
[5,"Diane MacDonald",{"$f":"VLOOKUP(B48,'2017 fell Table'!$B$3:$B$61,1,FALSE)","v":"Diane MacDonald"},21,{"$f":"VLOOKUP(B48,'Overall Champs'!C:C,1,FALSE)","v":{"$error":"#N/A"}},{"$f":"VLOOKUP(B48,'Overall Champs'!O:O,1,FALSE)","v":"Diane Macdonald"}]
[]
["Race 4","Coledale"]
["Position","Name",null,"Points"]
[1,"Paul Crabtree",{"$f":"VLOOKUP(B52,'2017 fell Table'!$B$3:$B$61,1,FALSE)","v":"Paul Crabtree"},{"$f":"26-A52","v":25},{"$f":"VLOOKUP(B52,'Overall Champs'!C:C,1,FALSE)","v":"Paul Crabtree"},{"$f":"VLOOKUP(B52,'Overall Champs'!O:O,1,FALSE)","v":{"$error":"#N/A"}}]
[2,"Dave Evans",{"$f":"VLOOKUP(B53,'2017 fell Table'!$B$3:$B$61,1,FALSE)","v":"Dave Evans"},{"$f":"26-A53","v":24},{"$f":"VLOOKUP(B53,'Overall Champs'!C:C,1,FALSE)","v":"Dave Evans"},{"$f":"VLOOKUP(B53,'Overall Champs'!O:O,1,FALSE)","v":{"$error":"#N/A"}}]
[3,"John-Paul Hopkinson",{"$f":"VLOOKUP(B54,'2017 fell Table'!$B$3:$B$61,1,FALSE)","v":"John-Paul Hopkinson"},23,{"$f":"VLOOKUP(B54,'Overall Champs'!C:C,1,FALSE)","v":"John-Paul Hopkinson"},{"$f":"VLOOKUP(B54,'Overall Champs'!O:O,1,FALSE)","v":{"$error":"#N/A"}}]
[4,"Peter Lloyd",{"$f":"VLOOKUP(B55,'2017 fell Table'!$B$3:$B$61,1,FALSE)","v":"Peter Lloyd"},22,{"$f":"VLOOKUP(B55,'Overall Champs'!C:C,1,FALSE)","v":"Peter Lloyd"},{"$f":"VLOOKUP(B55,'Overall Champs'!O:O,1,FALSE)","v":{"$error":"#N/A"}}]
[1,"Hilary Barber",{"$f":"VLOOKUP(B56,'2017 fell Table'!$B$3:$B$61,1,FALSE)","v":"Hilary Barber"},25,{"$f":"VLOOKUP(B56,'Overall Champs'!C:C,1,FALSE)","v":{"$error":"#N/A"}},{"$f":"VLOOKUP(B56,'Overall Champs'!O:O,1,FALSE)","v":"Hilary Barber"}]
[5,"Tim Thom",{"$f":"VLOOKUP(B57,'2017 fell Table'!$B$3:$B$61,1,FALSE)","v":"Tim Thom"},21,{"$f":"VLOOKUP(B57,'Overall Champs'!C:C,1,FALSE)","v":"Tim Thom"},{"$f":"VLOOKUP(B57,'Overall Champs'!O:O,1,FALSE)","v":{"$error":"#N/A"}}]
[6,"Richard Hindle",{"$f":"VLOOKUP(B58,'2017 fell Table'!$B$3:$B$61,1,FALSE)","v":"Richard Hindle"},20,{"$f":"VLOOKUP(B58,'Overall Champs'!C:C,1,FALSE)","v":"Richard Hindle"},{"$f":"VLOOKUP(B58,'Overall Champs'!O:O,1,FALSE)","v":{"$error":"#N/A"}}]
[2,"Tracey Hodgson",{"$f":"VLOOKUP(B59,'2017 fell Table'!$B$3:$B$61,1,FALSE)","v":"Tracey Hodgson"},24,{"$f":"VLOOKUP(B59,'Overall Champs'!C:C,1,FALSE)","v":{"$error":"#N/A"}},{"$f":"VLOOKUP(B59,'Overall Champs'!O:O,1,FALSE)","v":"Tracey Hodgson"}]
[3,"Hannah Thom",{"$f":"VLOOKUP(B60,'2017 fell Table'!$B$3:$B$61,1,FALSE)","v":"Hannah Thom"},23,{"$f":"VLOOKUP(B60,'Overall Champs'!C:C,1,FALSE)","v":{"$error":"#N/A"}},{"$f":"VLOOKUP(B60,'Overall Champs'!O:O,1,FALSE)","v":"Hannah Thom"}]
[4,null,{"$f":"VLOOKUP(B61,'2017 fell Table'!$B$3:$B$61,1,FALSE)","v":{"$error":"#N/A"}},22]
[7,null,{"$f":"VLOOKUP(B62,'2017 fell Table'!$B$3:$B$61,1,FALSE)","v":{"$error":"#N/A"}},19]
[5,null,{"$f":"VLOOKUP(B63,'2017 fell Table'!$B$3:$B$61,1,FALSE)","v":{"$error":"#N/A"}},21]
[]
["Race 5"]
["Position","Name",null,"Points"]
[1,null,{"$f":"VLOOKUP(B67,'2017 fell Table'!$B$3:$B$61,1,FALSE)","v":{"$error":"#N/A"}},{"$f":"26-A67","v":25}]
[2,null,{"$f":"VLOOKUP(B68,'2017 fell Table'!$B$3:$B$61,1,FALSE)","v":{"$error":"#N/A"}},{"$f":"26-A68","v":24}]
[3,null,{"$f":"VLOOKUP(B69,'2017 fell Table'!$B$3:$B$61,1,FALSE)","v":{"$error":"#N/A"}},23]
[4,null,{"$f":"VLOOKUP(B70,'2017 fell Table'!$B$3:$B$61,1,FALSE)","v":{"$error":"#N/A"}},22]
[1,null,{"$f":"VLOOKUP(B71,'2017 fell Table'!$B$3:$B$61,1,FALSE)","v":{"$error":"#N/A"}},25]
[5,null,{"$f":"VLOOKUP(B72,'2017 fell Table'!$B$3:$B$61,1,FALSE)","v":{"$error":"#N/A"}},21]
[6,null,{"$f":"VLOOKUP(B73,'2017 fell Table'!$B$3:$B$61,1,FALSE)","v":{"$error":"#N/A"}},20]
[2,null,{"$f":"VLOOKUP(B74,'2017 fell Table'!$B$3:$B$61,1,FALSE)","v":{"$error":"#N/A"}},24]
[3,null,{"$f":"VLOOKUP(B75,'2017 fell Table'!$B$3:$B$61,1,FALSE)","v":{"$error":"#N/A"}},23]
[4,null,{"$f":"VLOOKUP(B76,'2017 fell Table'!$B$3:$B$61,1,FALSE)","v":{"$error":"#N/A"}},22]
[7,null,{"$f":"VLOOKUP(B77,'2017 fell Table'!$B$3:$B$61,1,FALSE)","v":{"$error":"#N/A"}},19]
[5,null,{"$f":"VLOOKUP(B78,'2017 fell Table'!$B$3:$B$61,1,FALSE)","v":{"$error":"#N/A"}},21]
[]
["Race 6"]
["Position","Name",null,"Points"]
[1,null,{"$f":"VLOOKUP(B82,'2017 fell Table'!$B$3:$B$61,1,FALSE)","v":{"$error":"#N/A"}},{"$f":"26-A82","v":25}]
[2,null,{"$f":"VLOOKUP(B83,'2017 fell Table'!$B$3:$B$61,1,FALSE)","v":{"$error":"#N/A"}},{"$f":"26-A83","v":24}]
[3,null,{"$f":"VLOOKUP(B84,'2017 fell Table'!$B$3:$B$61,1,FALSE)","v":{"$error":"#N/A"}},23]
[4,null,{"$f":"VLOOKUP(B85,'2017 fell Table'!$B$3:$B$61,1,FALSE)","v":{"$error":"#N/A"}},22]
[1,null,{"$f":"VLOOKUP(B86,'2017 fell Table'!$B$3:$B$61,1,FALSE)","v":{"$error":"#N/A"}},25]
[5,null,{"$f":"VLOOKUP(B87,'2017 fell Table'!$B$3:$B$61,1,FALSE)","v":{"$error":"#N/A"}},21]
[6,null,{"$f":"VLOOKUP(B88,'2017 fell Table'!$B$3:$B$61,1,FALSE)","v":{"$error":"#N/A"}},20]
[2,null,{"$f":"VLOOKUP(B89,'2017 fell Table'!$B$3:$B$61,1,FALSE)","v":{"$error":"#N/A"}},24]
[3,null,{"$f":"VLOOKUP(B90,'2017 fell Table'!$B$3:$B$61,1,FALSE)","v":{"$error":"#N/A"}},23]
[4,null,{"$f":"VLOOKUP(B91,'2017 fell Table'!$B$3:$B$61,1,FALSE)","v":{"$error":"#N/A"}},22]
[7,null,{"$f":"VLOOKUP(B92,'2017 fell Table'!$B$3:$B$61,1,FALSE)","v":{"$error":"#N/A"}},19]
[5,null,{"$f":"VLOOKUP(B93,'2017 fell Table'!$B$3:$B$61,1,FALSE)","v":{"$error":"#N/A"}},21]
[]
["Race 7"]
["Position","Name",null,"Points"]
[1,null,{"$f":"VLOOKUP(B97,'2017 fell Table'!$B$3:$B$61,1,FALSE)","v":{"$error":"#N/A"}},{"$f":"26-A97","v":25}]
[2,null,{"$f":"VLOOKUP(B98,'2017 fell Table'!$B$3:$B$61,1,FALSE)","v":{"$error":"#N/A"}},{"$f":"26-A98","v":24}]
[3,null,{"$f":"VLOOKUP(B99,'2017 fell Table'!$B$3:$B$61,1,FALSE)","v":{"$error":"#N/A"}},23]
[4,null,{"$f":"VLOOKUP(B100,'2017 fell Table'!$B$3:$B$61,1,FALSE)","v":{"$error":"#N/A"}},22]
[1,null,{"$f":"VLOOKUP(B101,'2017 fell Table'!$B$3:$B$61,1,FALSE)","v":{"$error":"#N/A"}},25]
[5,null,{"$f":"VLOOKUP(B102,'2017 fell Table'!$B$3:$B$61,1,FALSE)","v":{"$error":"#N/A"}},21]
[6,null,{"$f":"VLOOKUP(B103,'2017 fell Table'!$B$3:$B$61,1,FALSE)","v":{"$error":"#N/A"}},20]
[2,null,{"$f":"VLOOKUP(B104,'2017 fell Table'!$B$3:$B$61,1,FALSE)","v":{"$error":"#N/A"}},24]
[3,null,{"$f":"VLOOKUP(B105,'2017 fell Table'!$B$3:$B$61,1,FALSE)","v":{"$error":"#N/A"}},23]
[4,null,{"$f":"VLOOKUP(B106,'2017 fell Table'!$B$3:$B$61,1,FALSE)","v":{"$error":"#N/A"}},22]
[7,null,{"$f":"VLOOKUP(B107,'2017 fell Table'!$B$3:$B$61,1,FALSE)","v":{"$error":"#N/A"}},19]
[5,null,{"$f":"VLOOKUP(B108,'2017 fell Table'!$B$3:$B$61,1,FALSE)","v":{"$error":"#N/A"}},21]
[]
["Race 8"]
["Position","Name",null,"Points"]
[1,null,{"$f":"VLOOKUP(B112,'2017 fell Table'!$B$3:$B$61,1,FALSE)","v":{"$error":"#N/A"}},{"$f":"26-A112","v":25}]
[2,null,{"$f":"VLOOKUP(B113,'2017 fell Table'!$B$3:$B$61,1,FALSE)","v":{"$error":"#N/A"}},{"$f":"26-A113","v":24}]
[3,null,{"$f":"VLOOKUP(B114,'2017 fell Table'!$B$3:$B$61,1,FALSE)","v":{"$error":"#N/A"}},23]
[4,null,{"$f":"VLOOKUP(B115,'2017 fell Table'!$B$3:$B$61,1,FALSE)","v":{"$error":"#N/A"}},22]
[1,null,{"$f":"VLOOKUP(B116,'2017 fell Table'!$B$3:$B$61,1,FALSE)","v":{"$error":"#N/A"}},25]
[5,null,{"$f":"VLOOKUP(B117,'2017 fell Table'!$B$3:$B$61,1,FALSE)","v":{"$error":"#N/A"}},21]
[6,null,{"$f":"VLOOKUP(B118,'2017 fell Table'!$B$3:$B$61,1,FALSE)","v":{"$error":"#N/A"}},20]
[2,null,{"$f":"VLOOKUP(B119,'2017 fell Table'!$B$3:$B$61,1,FALSE)","v":{"$error":"#N/A"}},24]
[3,null,{"$f":"VLOOKUP(B120,'2017 fell Table'!$B$3:$B$61,1,FALSE)","v":{"$error":"#N/A"}},23]
[4,null,{"$f":"VLOOKUP(B121,'2017 fell Table'!$B$3:$B$61,1,FALSE)","v":{"$error":"#N/A"}},22]
[7,null,{"$f":"VLOOKUP(B122,'2017 fell Table'!$B$3:$B$61,1,FALSE)","v":{"$error":"#N/A"}},19]
[5,null,{"$f":"VLOOKUP(B123,'2017 fell Table'!$B$3:$B$61,1,FALSE)","v":{"$error":"#N/A"}},21]
[]
["Race 9"]
["Position","Name",null,"Points"]
[1,null,{"$f":"VLOOKUP(B127,'2017 fell Table'!$B$3:$B$61,1,FALSE)","v":{"$error":"#N/A"}},{"$f":"26-A127","v":25}]
[2,null,{"$f":"VLOOKUP(B128,'2017 fell Table'!$B$3:$B$61,1,FALSE)","v":{"$error":"#N/A"}},{"$f":"26-A128","v":24}]
[3,null,{"$f":"VLOOKUP(B129,'2017 fell Table'!$B$3:$B$61,1,FALSE)","v":{"$error":"#N/A"}},23]
[4,null,{"$f":"VLOOKUP(B130,'2017 fell Table'!$B$3:$B$61,1,FALSE)","v":{"$error":"#N/A"}},22]
[1,null,{"$f":"VLOOKUP(B131,'2017 fell Table'!$B$3:$B$61,1,FALSE)","v":{"$error":"#N/A"}},25]
[5,null,{"$f":"VLOOKUP(B132,'2017 fell Table'!$B$3:$B$61,1,FALSE)","v":{"$error":"#N/A"}},21]
[6,null,{"$f":"VLOOKUP(B133,'2017 fell Table'!$B$3:$B$61,1,FALSE)","v":{"$error":"#N/A"}},20]
[2,null,{"$f":"VLOOKUP(B134,'2017 fell Table'!$B$3:$B$61,1,FALSE)","v":{"$error":"#N/A"}},24]
[3,null,{"$f":"VLOOKUP(B135,'2017 fell Table'!$B$3:$B$61,1,FALSE)","v":{"$error":"#N/A"}},23]
[4,null,{"$f":"VLOOKUP(B136,'2017 fell Table'!$B$3:$B$61,1,FALSE)","v":{"$error":"#N/A"}},22]
[7,null,{"$f":"VLOOKUP(B137,'2017 fell Table'!$B$3:$B$61,1,FALSE)","v":{"$error":"#N/A"}},19]
[5,null,{"$f":"VLOOKUP(B138,'2017 fell Table'!$B$3:$B$61,1,FALSE)","v":{"$error":"#N/A"}},21]

{"sheet":"2017 Road results","index":9,"n_rows":23,"n_cols":17,"rows_kept":23,"cut":false,"hidden":false,"merged":[]}
["Race 1 ","Bradford 10k"]
["Position","Name","table look up","Points","overall champs lookup male","overall champs lookup female"]
[1,"Craig Cooper",{"$f":"VLOOKUP(B3,'2017 Road Table'!$B$3:$B$58,1,FALSE)","v":"Craig Cooper"},{"$f":"26-A3","v":25},{"$f":"VLOOKUP(B3,'Overall Champs'!C:C,1,FALSE)","v":"Craig Cooper"},{"$f":"VLOOKUP(B3,'Overall Champs'!O:O,1,FALSE)","v":{"$error":"#N/A"}},null,1925,"Craig Cooper","Male","M40","Keighley & Craven AC","00:40:25","00:40:23",43,11,50]
[1,"Tizz Woffenden",{"$f":"VLOOKUP(B4,'2017 Road Table'!$B$3:$B$58,1,FALSE)","v":"Tizz Woffenden"},25,{"$f":"VLOOKUP(B4,'Overall Champs'!C:C,1,FALSE)","v":{"$error":"#N/A"}},{"$f":"VLOOKUP(B4,'Overall Champs'!O:O,1,FALSE)","v":"Tizz Woffenden"},null,1721,"Elisa Woffenden","Female","F40","Keighley & Craven AC","00:41:10","00:41:06",8,3,66]
[2,"Sarah O'Sullivan",{"$f":"VLOOKUP(B5,'2017 Road Table'!$B$3:$B$58,1,FALSE)","v":"Sarah O'Sullivan"},24,{"$f":"VLOOKUP(B5,'Overall Champs'!C:C,1,FALSE)","v":{"$error":"#N/A"}},{"$f":"VLOOKUP(B5,'Overall Champs'!O:O,1,FALSE)","v":"Sarah O'Sullivan"},null,964,"Sarah O'Sullivan","Female","F40","Keighley & Craven AC","00:43:14","00:43:11",14,6,125]
[2,"Chris Tomes",{"$f":"VLOOKUP(B6,'2017 Road Table'!$B$3:$B$58,1,FALSE)","v":"Chris Tomes"},24,{"$f":"VLOOKUP(B6,'Overall Champs'!C:C,1,FALSE)","v":"Chris Tomes"},{"$f":"VLOOKUP(B6,'Overall Champs'!O:O,1,FALSE)","v":{"$error":"#N/A"}},null,1084,"Chris Tomes","Male","M60","Keighley & Craven AC","00:43:19","00:43:16",109,6,133]
[3,"Paul Wilson",{"$f":"VLOOKUP(B7,'2017 Road Table'!$B$3:$B$58,1,FALSE)","v":"Paul Wilson"},23,{"$f":"VLOOKUP(B7,'Overall Champs'!C:C,1,FALSE)","v":"Paul Wilson"},{"$f":"VLOOKUP(B7,'Overall Champs'!O:O,1,FALSE)","v":{"$error":"#N/A"}},null,340,"Paul Wilson","Male","M40","Keighley & Craven AC","00:44:06","00:44:02",136,43,159]
[3,"Amanda Sterling",{"$f":"VLOOKUP(B8,'2017 Road Table'!$B$3:$B$58,1,FALSE)","v":"Amanda Sterling"},23,{"$f":"VLOOKUP(B8,'Overall Champs'!C:C,1,FALSE)","v":{"$error":"#N/A"}},{"$f":"VLOOKUP(B8,'Overall Champs'!O:O,1,FALSE)","v":"Amanda Sterling"},null,973,"Amanda Sterling","Female","F40","Keighley & Craven AC","00:44:06","00:44:00",22,9,158]
[4,"Camille Askins",{"$f":"VLOOKUP(B9,'2017 Road Table'!$B$3:$B$58,1,FALSE)","v":"Camille Askins"},22,{"$f":"VLOOKUP(B9,'Overall Champs'!C:C,1,FALSE)","v":{"$error":"#N/A"}},{"$f":"VLOOKUP(B9,'Overall Champs'!O:O,1,FALSE)","v":"Camille Askins"},null,948,"Camille Askins","Female","F40","Keighley & Craven AC","00:44:28","00:44:22",25,10,169]
[4,"Richard Butter",{"$f":"VLOOKUP(B10,'2017 Road Table'!$B$3:$B$58,1,FALSE)","v":"Richard Butter"},{"$f":"26-A10","v":22},{"$f":"VLOOKUP(B10,'Overall Champs'!C:C,1,FALSE)","v":"Richard Butter"},{"$f":"VLOOKUP(B10,'Overall Champs'!O:O,1,FALSE)","v":{"$error":"#N/A"}},null,1158,"Richard Butter","Male","M40",null,"00:44:51","00:44:47",150,48,183]
[5,"Anand Raval",{"$f":"VLOOKUP(B11,'2017 Road Table'!$B$3:$B$58,1,FALSE)","v":"Anand Raval"},21,{"$f":"VLOOKUP(B11,'Overall Champs'!C:C,1,FALSE)","v":"Anand Raval"},{"$f":"VLOOKUP(B11,'Overall Champs'!O:O,1,FALSE)","v":{"$error":"#N/A"}},null,1745,"Anand Raval","Male","MSen","Keighley & Craven AC","00:46:51","00:46:46",226,102,277]
[5,"Kayleigh Fish",{"$f":"VLOOKUP(B12,'2017 Road Table'!$B$3:$B$58,1,FALSE)","v":"Kayleigh Fish"},21,{"$f":"VLOOKUP(B12,'Overall Champs'!C:C,1,FALSE)","v":{"$error":"#N/A"}},{"$f":"VLOOKUP(B12,'Overall Champs'!O:O,1,FALSE)","v":"Kayleigh Fish"},null,2060,"Kayleigh Fish","Female","FSen","Keighley & Craven AC","00:47:49","00:47:09",48,2,372]
[6,"Hannah Yates",{"$f":"VLOOKUP(B13,'2017 Road Table'!$B$3:$B$58,1,FALSE)","v":"Hannah Yates"},20,{"$f":"VLOOKUP(B13,'Overall Champs'!C:C,1,FALSE)","v":{"$error":"#N/A"}},{"$f":"VLOOKUP(B13,'Overall Champs'!O:O,1,FALSE)","v":"Hannah Yates"},null,1210,"Hannah Yates","Female","FU21","Keighley & Craven AC","00:48:37","00:48:32",129,7,621]
[null,null,null,null,{"$f":"VLOOKUP(B14,'Overall Champs'!C:C,1,FALSE)","v":{"$error":"#N/A"}},{"$f":"VLOOKUP(B14,'Overall Champs'!O:O,1,FALSE)","v":{"$error":"#N/A"}},null,1957,"Gaynor Yates","Female","FU21","Keighley & Craven AC","00:53:01","00:52:55"]
[6,"Simon Chester",{"$f":"VLOOKUP(B15,'2017 Road Table'!$B$3:$B$58,1,FALSE)","v":"Simon Chester"},{"$f":"26-A15","v":20},{"$f":"VLOOKUP(B15,'Overall Champs'!C:C,1,FALSE)","v":"Simon Chester"},{"$f":"VLOOKUP(B15,'Overall Champs'!O:O,1,FALSE)","v":{"$error":"#N/A"}},null,null,"Simon Chester","Male",null,null,null,null,153,55,698]
[7,"Sarah Meikle",{"$f":"VLOOKUP(B16,'2017 Road Table'!$B$3:$B$58,1,FALSE)","v":"Sarah Meikle"},19,{"$f":"VLOOKUP(B16,'Overall Champs'!C:C,1,FALSE)","v":{"$error":"#N/A"}},{"$f":"VLOOKUP(B16,'Overall Champs'!O:O,1,FALSE)","v":"Sarah Meikle"},null,593,"Sarah Meikle","Female",null,"Keighley & Craven AC","00:54:17","00:54:17"]
[8,"Tracey Hodgson",{"$f":"VLOOKUP(B17,'2017 Road Table'!$B$3:$B$58,1,FALSE)","v":"Tracey Hodgson"},18,{"$f":"VLOOKUP(B17,'Overall Champs'!C:C,1,FALSE)","v":{"$error":"#N/A"}},{"$f":"VLOOKUP(B17,'Overall Champs'!O:O,1,FALSE)","v":"Tracey Hodgson"},null,null,"Tracey Hodgson","Female",null,null,null,null,197,16,716]
[9,"Luisa Lauren",{"$f":"VLOOKUP(B18,'2017 Road Table'!$B$3:$B$58,1,FALSE)","v":"Luisa Lauren"},17,{"$f":"VLOOKUP(B18,'Overall Champs'!C:C,1,FALSE)","v":{"$error":"#N/A"}},{"$f":"VLOOKUP(B18,'Overall Champs'!O:O,1,FALSE)","v":"Luisa Lauren"},null,2011,"Luisa Lauren","Female","F40","Keighley & Craven AC","00:55:58","00:54:33",219,78,859]
[10,"Paula Williams",{"$f":"VLOOKUP(B19,'2017 Road Table'!$B$3:$B$58,1,FALSE)","v":"Paula Williams"},16,{"$f":"VLOOKUP(B19,'Overall Champs'!C:C,1,FALSE)","v":{"$error":"#N/A"}},{"$f":"VLOOKUP(B19,'Overall Champs'!O:O,1,FALSE)","v":"Paula Williams"},null,1368,"Paula Williams","Female","F50","Keighley & Craven AC","00:56:44","00:56:31",261,22,915]
[11,"Catherine Bellwood",{"$f":"VLOOKUP(B20,'2017 Road Table'!$B$3:$B$58,1,FALSE)","v":"Catherine Bellwood"},15,{"$f":"VLOOKUP(B20,'Overall Champs'!C:C,1,FALSE)","v":{"$error":"#N/A"}},{"$f":"VLOOKUP(B20,'Overall Champs'!O:O,1,FALSE)","v":"Catherine Bellwood"},null,1797,"Catherine Bellwood","Female","F40","Keighley & Craven AC","00:58:03","00:57:32",495,13,1327]
[12,"Mary Hodgkiss",{"$f":"VLOOKUP(B21,'2017 Road Table'!$B$3:$B$58,1,FALSE)","v":"Mary Hodgkiss"},14,{"$f":"VLOOKUP(B21,'Overall Champs'!C:C,1,FALSE)","v":{"$error":"#N/A"}},{"$f":"VLOOKUP(B21,'Overall Champs'!O:O,1,FALSE)","v":"Mary Hodgkiss"},null,518,"Mary Hodgkiss","Female","F50","Keighley & Craven AC","01:05:45","01:05:07",597,284,1470]
[13,"Andrea Stead",{"$f":"VLOOKUP(B22,'2017 Road Table'!$B$3:$B$58,1,FALSE)","v":"Andrea Stead"},13,{"$f":"VLOOKUP(B22,'Overall Champs'!C:C,1,FALSE)","v":{"$error":"#N/A"}},{"$f":"VLOOKUP(B22,'Overall Champs'!O:O,1,FALSE)","v":"Andrea Stead"},null,1746,"Andrea Stead","Female","F60","Keighley & Craven AC","01:10:15","01:09:48"]
[null,null,null,null,null,null,null,null,null,null,"FSen"]

{"sheet":"2017 xc results","index":10,"n_rows":136,"n_cols":6,"rows_kept":136,"cut":false,"hidden":false,"merged":[]}
["Race 1 Yorkshire"]
["Position","Name",null,"Points","overall champs lookup","overall champs lookup"]
[1,"Ian Willis",{"$f":"VLOOKUP(B3,'2017 xc Table'!$B$3:$B$60,1,FALSE)","v":"Ian Willis"},{"$f":"26-A3","v":25},{"$f":"VLOOKUP(B3,'Overall Champs'!C:C,1,FALSE)","v":"Ian Willis"},{"$f":"VLOOKUP(B3,'Overall Champs'!O:O,1,FALSE)","v":{"$error":"#N/A"}}]
[2,"Scott Bairstow",{"$f":"VLOOKUP(B4,'2017 xc Table'!$B$3:$B$60,1,FALSE)","v":"Scott Bairstow"},24,{"$f":"VLOOKUP(B4,'Overall Champs'!C:C,1,FALSE)","v":"Scott Bairstow"},{"$f":"VLOOKUP(B4,'Overall Champs'!O:O,1,FALSE)","v":{"$error":"#N/A"}}]
[3,"John Conroy",{"$f":"VLOOKUP(B5,'2017 xc Table'!$B$3:$B$60,1,FALSE)","v":"John Conroy"},23,{"$f":"VLOOKUP(B5,'Overall Champs'!C:C,1,FALSE)","v":"John Conroy"},{"$f":"VLOOKUP(B5,'Overall Champs'!O:O,1,FALSE)","v":{"$error":"#N/A"}}]
[1,"Tizz Woffenden",{"$f":"VLOOKUP(B6,'2017 xc Table'!$B$3:$B$60,1,FALSE)","v":"Tizz Woffenden"},25,{"$f":"VLOOKUP(B6,'Overall Champs'!C:C,1,FALSE)","v":{"$error":"#N/A"}},{"$f":"VLOOKUP(B6,'Overall Champs'!O:O,1,FALSE)","v":"Tizz Woffenden"}]
[2,"Claire Cooper",{"$f":"VLOOKUP(B7,'2017 xc Table'!$B$3:$B$60,1,FALSE)","v":"Claire Cooper"},24,{"$f":"VLOOKUP(B7,'Overall Champs'!C:C,1,FALSE)","v":{"$error":"#N/A"}},{"$f":"VLOOKUP(B7,'Overall Champs'!O:O,1,FALSE)","v":"Claire Cooper"}]
[3,"Sarah O'Sullivan",{"$f":"VLOOKUP(B8,'2017 xc Table'!$B$3:$B$60,1,FALSE)","v":"Sarah O'Sullivan"},23,{"$f":"VLOOKUP(B8,'Overall Champs'!C:C,1,FALSE)","v":{"$error":"#N/A"}},{"$f":"VLOOKUP(B8,'Overall Champs'!O:O,1,FALSE)","v":"Sarah O'Sullivan"}]
[4,"Angela Paxton",{"$f":"VLOOKUP(B9,'2017 xc Table'!$B$3:$B$60,1,FALSE)","v":"Angela Paxton"},22,{"$f":"VLOOKUP(B9,'Overall Champs'!C:C,1,FALSE)","v":{"$error":"#N/A"}},{"$f":"VLOOKUP(B9,'Overall Champs'!O:O,1,FALSE)","v":"Angela Paxton"}]
[5,"Camille Askins",{"$f":"VLOOKUP(B10,'2017 xc Table'!$B$3:$B$60,1,FALSE)","v":"Camille Askins"},21,{"$f":"VLOOKUP(B10,'Overall Champs'!C:C,1,FALSE)","v":{"$error":"#N/A"}},{"$f":"VLOOKUP(B10,'Overall Champs'!O:O,1,FALSE)","v":"Camille Askins"}]
[null,null,{"$f":"VLOOKUP(B11,'2017 xc Table'!$B$3:$B$60,1,FALSE)","v":{"$error":"#N/A"}},26,{"$f":"VLOOKUP(B11,'Overall Champs'!C:C,1,FALSE)","v":{"$error":"#N/A"}},{"$f":"VLOOKUP(B11,'Overall Champs'!O:O,1,FALSE)","v":{"$error":"#N/A"}}]
[null,null,{"$f":"VLOOKUP(B12,'2017 xc Table'!$B$3:$B$60,1,FALSE)","v":{"$error":"#N/A"}},26,{"$f":"VLOOKUP(B12,'Overall Champs'!C:C,1,FALSE)","v":{"$error":"#N/A"}},{"$f":"VLOOKUP(B12,'Overall Champs'!O:O,1,FALSE)","v":{"$error":"#N/A"}}]
[null,null,{"$f":"VLOOKUP(B13,'2017 xc Table'!$B$3:$B$60,1,FALSE)","v":{"$error":"#N/A"}},26,{"$f":"VLOOKUP(B13,'Overall Champs'!C:C,1,FALSE)","v":{"$error":"#N/A"}},{"$f":"VLOOKUP(B13,'Overall Champs'!O:O,1,FALSE)","v":{"$error":"#N/A"}}]
[null,null,null,null,{"$f":"VLOOKUP(B14,'Overall Champs'!C:C,1,FALSE)","v":{"$error":"#N/A"}},{"$f":"VLOOKUP(B14,'Overall Champs'!O:O,1,FALSE)","v":{"$error":"#N/A"}}]
["Race 2 National"]
["Position","Name",null,"Points"]
[1,"Scott Bairstow",{"$f":"VLOOKUP(B17,'2017 xc Table'!$B$3:$B$60,1,FALSE)","v":"Scott Bairstow"},{"$f":"26-A17","v":25}]
[2,"John Conroy",{"$f":"VLOOKUP(B18,'2017 xc Table'!$B$3:$B$60,1,FALSE)","v":"John Conroy"},{"$f":"26-A18","v":24}]
[3,null,{"$f":"VLOOKUP(B19,'2017 xc Table'!$B$3:$B$60,1,FALSE)","v":{"$error":"#N/A"}},23]
[4,null,{"$f":"VLOOKUP(B20,'2017 xc Table'!$B$3:$B$60,1,FALSE)","v":{"$error":"#N/A"}},22]
[5,null,{"$f":"VLOOKUP(B21,'2017 xc Table'!$B$3:$B$60,1,FALSE)","v":{"$error":"#N/A"}},21]
[6,null,{"$f":"VLOOKUP(B22,'2017 xc Table'!$B$3:$B$60,1,FALSE)","v":{"$error":"#N/A"}},20]
[7,null,{"$f":"VLOOKUP(B23,'2017 xc Table'!$B$3:$B$60,1,FALSE)","v":{"$error":"#N/A"}},19]
[8,null,{"$f":"VLOOKUP(B24,'2017 xc Table'!$B$3:$B$60,1,FALSE)","v":{"$error":"#N/A"}},18]
[1,null,{"$f":"VLOOKUP(B25,'2017 xc Table'!$B$3:$B$60,1,FALSE)","v":{"$error":"#N/A"}},25]
[2,null,{"$f":"VLOOKUP(B26,'2017 xc Table'!$B$3:$B$60,1,FALSE)","v":{"$error":"#N/A"}},24]
[9,null,{"$f":"VLOOKUP(B27,'2017 xc Table'!$B$3:$B$60,1,FALSE)","v":{"$error":"#N/A"}},17]
[9,null,{"$f":"VLOOKUP(B28,'2017 xc Table'!$B$3:$B$60,1,FALSE)","v":{"$error":"#N/A"}},17]
[4,null,{"$f":"VLOOKUP(B29,'2017 xc Table'!$B$3:$B$60,1,FALSE)","v":{"$error":"#N/A"}},22]
[5,null,{"$f":"VLOOKUP(B30,'2017 xc Table'!$B$3:$B$60,1,FALSE)","v":{"$error":"#N/A"}},21]
[]
["Race 3","Stan Bradshaw"]
["Position","Name",null,"Points"]
[1,null,{"$f":"VLOOKUP(B34,'2017 xc Table'!$B$3:$B$60,1,FALSE)","v":{"$error":"#N/A"}},{"$f":"26-A34","v":25}]
[2,null,{"$f":"VLOOKUP(B35,'2017 xc Table'!$B$3:$B$60,1,FALSE)","v":{"$error":"#N/A"}},{"$f":"26-A35","v":24}]
[3,null,{"$f":"VLOOKUP(B36,'2017 xc Table'!$B$3:$B$60,1,FALSE)","v":{"$error":"#N/A"}},{"$f":"26-A36","v":23}]
[4,null,{"$f":"VLOOKUP(B37,'2017 xc Table'!$B$3:$B$60,1,FALSE)","v":{"$error":"#N/A"}},22]
[5,null,{"$f":"VLOOKUP(B38,'2017 xc Table'!$B$3:$B$60,1,FALSE)","v":{"$error":"#N/A"}},21]
[1,null,{"$f":"VLOOKUP(B39,'2017 xc Table'!$B$3:$B$60,1,FALSE)","v":{"$error":"#N/A"}},25]
[2,null,{"$f":"VLOOKUP(B40,'2017 xc Table'!$B$3:$B$60,1,FALSE)","v":{"$error":"#N/A"}},24]
[6,null,{"$f":"VLOOKUP(B41,'2017 xc Table'!$B$3:$B$60,1,FALSE)","v":{"$error":"#N/A"}},20]
[7,null,{"$f":"VLOOKUP(B42,'2017 xc Table'!$B$3:$B$60,1,FALSE)","v":{"$error":"#N/A"}},19]
[3,null,{"$f":"VLOOKUP(B43,'2017 xc Table'!$B$3:$B$60,1,FALSE)","v":{"$error":"#N/A"}},23]
[8,null,{"$f":"VLOOKUP(B44,'2017 xc Table'!$B$3:$B$60,1,FALSE)","v":{"$error":"#N/A"}},18]
[4,null,{"$f":"VLOOKUP(B45,'2017 xc Table'!$B$3:$B$60,1,FALSE)","v":{"$error":"#N/A"}},22]
[5,null,{"$f":"VLOOKUP(B46,'2017 xc Table'!$B$3:$B$60,1,FALSE)","v":{"$error":"#N/A"}},21]
[]
["Race 4"]
["Position","Name",null,"Points"]
[1,null,{"$f":"VLOOKUP(B50,'2017 xc Table'!$B$3:$B$60,1,FALSE)","v":{"$error":"#N/A"}},{"$f":"26-A50","v":25}]
[2,null,{"$f":"VLOOKUP(B51,'2017 xc Table'!$B$3:$B$60,1,FALSE)","v":{"$error":"#N/A"}},{"$f":"26-A51","v":24}]
[3,null,{"$f":"VLOOKUP(B52,'2017 xc Table'!$B$3:$B$60,1,FALSE)","v":{"$error":"#N/A"}},23]
[4,null,{"$f":"VLOOKUP(B53,'2017 xc Table'!$B$3:$B$60,1,FALSE)","v":{"$error":"#N/A"}},22]
[1,null,{"$f":"VLOOKUP(B54,'2017 xc Table'!$B$3:$B$60,1,FALSE)","v":{"$error":"#N/A"}},25]
[5,null,{"$f":"VLOOKUP(B55,'2017 xc Table'!$B$3:$B$60,1,FALSE)","v":{"$error":"#N/A"}},21]
[6,null,{"$f":"VLOOKUP(B56,'2017 xc Table'!$B$3:$B$60,1,FALSE)","v":{"$error":"#N/A"}},20]
[2,null,{"$f":"VLOOKUP(B57,'2017 xc Table'!$B$3:$B$60,1,FALSE)","v":{"$error":"#N/A"}},24]
[3,null,{"$f":"VLOOKUP(B58,'2017 xc Table'!$B$3:$B$60,1,FALSE)","v":{"$error":"#N/A"}},23]
[4,null,{"$f":"VLOOKUP(B59,'2017 xc Table'!$B$3:$B$60,1,FALSE)","v":{"$error":"#N/A"}},22]
[7,null,{"$f":"VLOOKUP(B60,'2017 xc Table'!$B$3:$B$60,1,FALSE)","v":{"$error":"#N/A"}},19]
[5,null,{"$f":"VLOOKUP(B61,'2017 xc Table'!$B$3:$B$60,1,FALSE)","v":{"$error":"#N/A"}},21]
[]
["Race 5"]
["Position","Name",null,"Points"]
[1,null,{"$f":"VLOOKUP(B65,'2017 xc Table'!$B$3:$B$60,1,FALSE)","v":{"$error":"#N/A"}},{"$f":"26-A65","v":25}]
[2,null,{"$f":"VLOOKUP(B66,'2017 xc Table'!$B$3:$B$60,1,FALSE)","v":{"$error":"#N/A"}},{"$f":"26-A66","v":24}]
[3,null,{"$f":"VLOOKUP(B67,'2017 xc Table'!$B$3:$B$60,1,FALSE)","v":{"$error":"#N/A"}},23]
[4,null,{"$f":"VLOOKUP(B68,'2017 xc Table'!$B$3:$B$60,1,FALSE)","v":{"$error":"#N/A"}},22]
[1,null,{"$f":"VLOOKUP(B69,'2017 xc Table'!$B$3:$B$60,1,FALSE)","v":{"$error":"#N/A"}},25]
[5,null,{"$f":"VLOOKUP(B70,'2017 xc Table'!$B$3:$B$60,1,FALSE)","v":{"$error":"#N/A"}},21]
[6,null,{"$f":"VLOOKUP(B71,'2017 xc Table'!$B$3:$B$60,1,FALSE)","v":{"$error":"#N/A"}},20]
[2,null,{"$f":"VLOOKUP(B72,'2017 xc Table'!$B$3:$B$60,1,FALSE)","v":{"$error":"#N/A"}},24]
[3,null,{"$f":"VLOOKUP(B73,'2017 xc Table'!$B$3:$B$60,1,FALSE)","v":{"$error":"#N/A"}},23]
[4,null,{"$f":"VLOOKUP(B74,'2017 xc Table'!$B$3:$B$60,1,FALSE)","v":{"$error":"#N/A"}},22]
[7,null,{"$f":"VLOOKUP(B75,'2017 xc Table'!$B$3:$B$60,1,FALSE)","v":{"$error":"#N/A"}},19]
[5,null,{"$f":"VLOOKUP(B76,'2017 xc Table'!$B$3:$B$60,1,FALSE)","v":{"$error":"#N/A"}},21]
[]
["Race 6"]
["Position","Name",null,"Points"]
[1,null,{"$f":"VLOOKUP(B80,'2017 xc Table'!$B$3:$B$60,1,FALSE)","v":{"$error":"#N/A"}},{"$f":"26-A80","v":25}]
[2,null,{"$f":"VLOOKUP(B81,'2017 xc Table'!$B$3:$B$60,1,FALSE)","v":{"$error":"#N/A"}},{"$f":"26-A81","v":24}]
[3,null,{"$f":"VLOOKUP(B82,'2017 xc Table'!$B$3:$B$60,1,FALSE)","v":{"$error":"#N/A"}},23]
[4,null,{"$f":"VLOOKUP(B83,'2017 xc Table'!$B$3:$B$60,1,FALSE)","v":{"$error":"#N/A"}},22]
[1,null,{"$f":"VLOOKUP(B84,'2017 xc Table'!$B$3:$B$60,1,FALSE)","v":{"$error":"#N/A"}},25]
[5,null,{"$f":"VLOOKUP(B85,'2017 xc Table'!$B$3:$B$60,1,FALSE)","v":{"$error":"#N/A"}},21]
[6,null,{"$f":"VLOOKUP(B86,'2017 xc Table'!$B$3:$B$60,1,FALSE)","v":{"$error":"#N/A"}},20]
[2,null,{"$f":"VLOOKUP(B87,'2017 xc Table'!$B$3:$B$60,1,FALSE)","v":{"$error":"#N/A"}},24]
[3,null,{"$f":"VLOOKUP(B88,'2017 xc Table'!$B$3:$B$60,1,FALSE)","v":{"$error":"#N/A"}},23]
[4,null,{"$f":"VLOOKUP(B89,'2017 xc Table'!$B$3:$B$60,1,FALSE)","v":{"$error":"#N/A"}},22]
[7,null,{"$f":"VLOOKUP(B90,'2017 xc Table'!$B$3:$B$60,1,FALSE)","v":{"$error":"#N/A"}},19]
[5,null,{"$f":"VLOOKUP(B91,'2017 xc Table'!$B$3:$B$60,1,FALSE)","v":{"$error":"#N/A"}},21]
[]
["Race 7"]
["Position","Name",null,"Points"]
[1,null,{"$f":"VLOOKUP(B95,'2017 xc Table'!$B$3:$B$60,1,FALSE)","v":{"$error":"#N/A"}},{"$f":"26-A95","v":25}]
[2,null,{"$f":"VLOOKUP(B96,'2017 xc Table'!$B$3:$B$60,1,FALSE)","v":{"$error":"#N/A"}},{"$f":"26-A96","v":24}]
[3,null,{"$f":"VLOOKUP(B97,'2017 xc Table'!$B$3:$B$60,1,FALSE)","v":{"$error":"#N/A"}},23]
[4,null,{"$f":"VLOOKUP(B98,'2017 xc Table'!$B$3:$B$60,1,FALSE)","v":{"$error":"#N/A"}},22]
[1,null,{"$f":"VLOOKUP(B99,'2017 xc Table'!$B$3:$B$60,1,FALSE)","v":{"$error":"#N/A"}},25]
[5,null,{"$f":"VLOOKUP(B100,'2017 xc Table'!$B$3:$B$60,1,FALSE)","v":{"$error":"#N/A"}},21]
[6,null,{"$f":"VLOOKUP(B101,'2017 xc Table'!$B$3:$B$60,1,FALSE)","v":{"$error":"#N/A"}},20]
[2,null,{"$f":"VLOOKUP(B102,'2017 xc Table'!$B$3:$B$60,1,FALSE)","v":{"$error":"#N/A"}},24]
[3,null,{"$f":"VLOOKUP(B103,'2017 xc Table'!$B$3:$B$60,1,FALSE)","v":{"$error":"#N/A"}},23]
[4,null,{"$f":"VLOOKUP(B104,'2017 xc Table'!$B$3:$B$60,1,FALSE)","v":{"$error":"#N/A"}},22]
[7,null,{"$f":"VLOOKUP(B105,'2017 xc Table'!$B$3:$B$60,1,FALSE)","v":{"$error":"#N/A"}},19]
[5,null,{"$f":"VLOOKUP(B106,'2017 xc Table'!$B$3:$B$60,1,FALSE)","v":{"$error":"#N/A"}},21]
[]
["Race 8"]
["Position","Name",null,"Points"]
[1,null,{"$f":"VLOOKUP(B110,'2017 xc Table'!$B$3:$B$60,1,FALSE)","v":{"$error":"#N/A"}},{"$f":"26-A110","v":25}]
[2,null,{"$f":"VLOOKUP(B111,'2017 xc Table'!$B$3:$B$60,1,FALSE)","v":{"$error":"#N/A"}},{"$f":"26-A111","v":24}]
[3,null,{"$f":"VLOOKUP(B112,'2017 xc Table'!$B$3:$B$60,1,FALSE)","v":{"$error":"#N/A"}},23]
[4,null,{"$f":"VLOOKUP(B113,'2017 xc Table'!$B$3:$B$60,1,FALSE)","v":{"$error":"#N/A"}},22]
[1,null,{"$f":"VLOOKUP(B114,'2017 xc Table'!$B$3:$B$60,1,FALSE)","v":{"$error":"#N/A"}},25]
[5,null,{"$f":"VLOOKUP(B115,'2017 xc Table'!$B$3:$B$60,1,FALSE)","v":{"$error":"#N/A"}},21]
[6,null,{"$f":"VLOOKUP(B116,'2017 xc Table'!$B$3:$B$60,1,FALSE)","v":{"$error":"#N/A"}},20]
[2,null,{"$f":"VLOOKUP(B117,'2017 xc Table'!$B$3:$B$60,1,FALSE)","v":{"$error":"#N/A"}},24]
[3,null,{"$f":"VLOOKUP(B118,'2017 xc Table'!$B$3:$B$60,1,FALSE)","v":{"$error":"#N/A"}},23]
[4,null,{"$f":"VLOOKUP(B119,'2017 xc Table'!$B$3:$B$60,1,FALSE)","v":{"$error":"#N/A"}},22]
[7,null,{"$f":"VLOOKUP(B120,'2017 xc Table'!$B$3:$B$60,1,FALSE)","v":{"$error":"#N/A"}},19]
[5,null,{"$f":"VLOOKUP(B121,'2017 xc Table'!$B$3:$B$60,1,FALSE)","v":{"$error":"#N/A"}},21]
[]
["Race 9"]
["Position","Name",null,"Points"]
[1,null,{"$f":"VLOOKUP(B125,'2017 xc Table'!$B$3:$B$60,1,FALSE)","v":{"$error":"#N/A"}},{"$f":"26-A125","v":25}]
[2,null,{"$f":"VLOOKUP(B126,'2017 xc Table'!$B$3:$B$60,1,FALSE)","v":{"$error":"#N/A"}},{"$f":"26-A126","v":24}]
[3,null,{"$f":"VLOOKUP(B127,'2017 xc Table'!$B$3:$B$60,1,FALSE)","v":{"$error":"#N/A"}},23]
[4,null,{"$f":"VLOOKUP(B128,'2017 xc Table'!$B$3:$B$60,1,FALSE)","v":{"$error":"#N/A"}},22]
[1,null,{"$f":"VLOOKUP(B129,'2017 xc Table'!$B$3:$B$60,1,FALSE)","v":{"$error":"#N/A"}},25]
[5,null,{"$f":"VLOOKUP(B130,'2017 xc Table'!$B$3:$B$60,1,FALSE)","v":{"$error":"#N/A"}},21]
[6,null,{"$f":"VLOOKUP(B131,'2017 xc Table'!$B$3:$B$60,1,FALSE)","v":{"$error":"#N/A"}},20]
[2,null,{"$f":"VLOOKUP(B132,'2017 xc Table'!$B$3:$B$60,1,FALSE)","v":{"$error":"#N/A"}},24]
[3,null,{"$f":"VLOOKUP(B133,'2017 xc Table'!$B$3:$B$60,1,FALSE)","v":{"$error":"#N/A"}},23]
[4,null,{"$f":"VLOOKUP(B134,'2017 xc Table'!$B$3:$B$60,1,FALSE)","v":{"$error":"#N/A"}},22]
[7,null,{"$f":"VLOOKUP(B135,'2017 xc Table'!$B$3:$B$60,1,FALSE)","v":{"$error":"#N/A"}},19]
[5,null,{"$f":"VLOOKUP(B136,'2017 xc Table'!$B$3:$B$60,1,FALSE)","v":{"$error":"#N/A"}},21]

{"sheet":"Age Cat","index":11,"n_rows":260,"n_cols":8,"rows_kept":260,"cut":false,"hidden":false,"merged":[]}
[]
[null,null,null,null,null,"Abigail Knowles","J"]
[null,null,null,null,null,"Adie Greenwood","V50"]
[null,null,null,null,null,"Adrian Dunbar","V60"]
[null,null,null,null,null,"Adrian Thomas","V40"]
[null,null,null,null,null,"Adrienne Preston","V40"]
[null,null,null,null,null,"Alan Abbott","V40"]
[null,null,null,null,null,"Alan Kirton","V50"]
[null,null,null,null,null,"Alan Turner","V50"]
[null,null,null,null,null,"Alan Wright","V50"]
[null,null,null,null,null,"Alastair Wallace","V40"]
[null,null,null,null,null,"Alfie Walker","V40"]
[null,null,null,null,null,"Alison Walker","V40"]
[null,null,null,null,null,"Alistair Gavins ","V50"]
[null,null,null,null,null,"Amanda Burgess","V40"]
[null,null,null,null,null,"Amanda Harrison","V40"]
[null,null,null,null,null,"Amanda Sterling","V40"]
[null,null,null,null,null,"Amy McKechnie","V30"]
[null,null,null,null,null,"Anand Raval","V30","s"]
[null,null,null,null,null,"Andrew Brett","V40"]
[null,null,null,null,null,"Andrew Conally","V30"]
[null,null,null,null,null,"Andrew Green","V60"]
[null,null,null,null,null,"Andrew Hardaker","V40"]
[null,null,null,null,null,"Andrew Jackson","V40"]
[null,null,null,null,null,"Andrew Kitts","V50"]
[null,null,null,null,null,"Andrew Travis","V40"]
[null,null,null,null,null,"Angela Paxton","V50"]
[null,null,null,null,null,"Ania Sroka","V50"]
[null,null,null,null,null,"Ann Hopkinson","V50"]
[null,null,null,null,null,"Anthony B Knowles","V70"]
[null,null,null,null,null,"Anthony Raby","V70"]
[null,null,null,null,null,"Arthur John Leng","V60"]
[null,null,null,null,null,"Ayesha  Thompson","V30"]
[null,null,null,null,null,"Ben Timbers","V40"]
[null,null,null,null,null,"Beverley Hardie","V40"]
[null,null,null,null,null,"Brett Weeden","V50"]
[null,null,null,null,null,"Camille Askins","V40"]
[null,null,null,null,null,"Caren Crabtree","V40"]
[null,null,null,null,null,"Carl Jenkinson","V40"]
[null,null,null,null,null,"Carol Young","V50"]
[null,null,null,null,null,"Carole Allan","V50"]
[null,null,null,null,null,"Carolyn Howell","V60"]
[null,null,null,null,null,"Catherine Bellwood","V50"]
[null,null,null,null,null,"Catherine Mercer","V50"]
[null,null,null,null,null,"Charlie Marshall","V50"]
[null,null,null,null,null,"Chris Shaw","V50"]
[null,null,null,null,null,"Chris Tomes","V60"]
[null,null,null,null,null,"Christine Chapman","V40"]
[null,null,null,null,null,"Christopher (UKA 3612486) Whittel","V50"]
[null,null,null,null,null,"Christopher Howe","V30"]
[null,null,null,null,null,"Christopher Jones","V60"]
[null,null,null,null,null,"Christopher Loftus","V40"]
[null,null,null,null,null,"Claire Aspden","S"]
[null,null,null,null,null,"Claire Cooper","V30"]
[null,null,null,null,null,"Clare Smallwood","V40"]
[null,null,null,null,null,"Clare Smurthwaite","V40"]
[null,null,null,null,null,"Craig Cooper","V40"]
[null,null,null,null,null,"Craig Shearer","S"]
[null,null,null,null,null,"Damian Petrucci","V40"]
[null,null,null,null,null,"Dave Evans","V30"]
[null,null,null,null,null,"David Copping","V50"]
[null,null,null,null,null,"David Hamer","V50"]
[null,null,null,null,null,"David Ramsden","V70"]
[null,null,null,null,null,"David Seaward","V50"]
[null,null,null,null,null,"Dawn Rollins","V40"]
[null,null,null,null,null,"Debbie Spurr","V50"]
[null,null,null,null,null,"Deborah Peacock","V50"]
[null,null,null,null,null,"Deborah Walton","V40"]
[null,null,null,null,null,"Des Fretwell","V60"]
[null,null,null,null,null,"Diane Barker","V40"]
[null,null,null,null,null,"Diane Collett","V50"]
[null,null,null,null,null,"Diane Macdonald","V40"]
[null,null,null,null,null,"Diane Whiteoak","V40"]
[null,null,null,null,null,"Dick Ballantine","V50"]
[null,null,null,null,null,"Donna Chester","V30"]
[null,null,null,null,null,"Elizabeth Green","V40"]
[null,null,null,null,null,"Emily Whitehead","V40"]
[null,null,null,null,null,"Emma Dooks","V50"]
[null,null,null,null,null,"Emma Timbers","V40"]
[null,null,null,null,null,"Emma Wadsworth","V40"]
[null,null,null,null,null,"Estelle Willis","V40"]
[null,null,null,null,null,"Fiona Gostling","V50"]
[null,null,null,null,null,"Frankie Coulthread","S"]
[null,null,null,null,null,"Fraser Hardie","V50"]
[null,null,null,null,null,"Gary Chapman","V40"]
[null,null,null,null,null,"Gary Searby","V40"]
[null,null,null,null,null,"Gary Ward","V40"]
[null,null,null,null,null,"George Dennis","S"]
[null,null,null,null,null,"Georgie Sian Knappy","S"]
[null,null,null,null,null,"Gill Petrucci","V40"]
[null,null,null,null,null,"Gillian Robinson","V50"]
[null,null,null,null,null,"Hannah Thom","S"]
[null,null,null,null,null,"Hannah Yates","S"]
[null,null,null,null,null,"Heather Clapham","V30"]
[null,null,null,null,null,"Heather Crow","S"]
[null,null,null,null,null,"Helen Brett","V40"]
[null,null,null,null,null,"Helen Jackson","V40"]
[null,null,null,null,null,"Helen Margaret Cawkwell","V50"]
[null,null,null,null,null,"Helen Wright","V30"]
[null,null,null,null,null,"Hellen Collins","V30"]
[null,null,null,null,null,"Hilary Barber","V50"]
[null,null,null,null,null,"Hinda Hardaker","V40"]
[null,null,null,null,null,"Iain Ross Turner","V30"]
[null,null,null,null,null,"Ian H Smith","V50"]
[null,null,null,null,null,"Ian Lewis","V40"]
[null,null,null,null,null,"Ian Willis","V40"]
[null,null,null,null,null,"Irene Yates","V50"]
[null,null,null,null,null,"Jackie Kirton","V50"]
[null,null,null,null,null,"Jackie Rishton","V50"]
[null,null,null,null,null,"James Ashley","V40"]
[null,null,null,null,null,"James Callaghan","V40"]
[null,null,null,null,null,"James Pawson","V30"]
[null,null,null,null,null,"Jane Johnson","V50"]
[null,null,null,null,null,"Jane Sedgwick","V40"]
[null,null,null,null,null,"Janet-Alison Arkwright","V40"]
[null,null,null,null,null,"Jeremy O'Connell","V50"]
[null,null,null,null,null,"Jeremy Wilkinson","V40"]
[null,null,null,null,null,"Jill Bell","V50"]
[null,null,null,null,null,"Jim Roberts","V40"]
[null,null,null,null,null,"Jo Lewis","V50"]
[null,null,null,null,null,"Joanne Conroy","V40"]
[null,null,null,null,null,"Joanne Gaunt","V40"]
[null,null,null,null,null,"Joanne Griffiths","V30"]
[null,null,null,null,null,"Joe Atherton","V30"]
[null,null,null,null,null,"John Andrew Dennis","V50"]
[null,null,null,null,null,"John Conroy","V40"]
[null,null,null,null,null,"John-Henry Johnson","S"]
[null,null,null,null,null,"John-Paul Hopkinson","V40"]
[null,null,null,null,null,"Jonnie Butler","V60"]
[null,null,null,null,null,"Judith Ellis","V50"]
[null,null,null,null,null,"Julie Hart","V50"]
[null,null,null,null,null,"Julie Narey","V50"]
[null,null,null,null,null,"Karen Ballantine","V40"]
[null,null,null,null,null,"Katie Atherton","V30"]
[null,null,null,null,null,"Katrina Snowden","V40"]
[null,null,null,null,null,"Kayleigh Fish","S"]
[null,null,null,null,null,"Keith Waddingham","V50"]
[null,null,null,null,null,"Kellie Butterfield","V40"]
[null,null,null,null,null,"Kim Shaw","V50"]
[null,null,null,null,null,"Kirsty Pettit","V40"]
[null,null,null,null,null,"Koleen Wright","V50"]
[null,null,null,null,null,"Larraine Stott","V40"]
[null,null,null,null,null,"Laura Jackson","V60"]
[null,null,null,null,null,"Lee Ricketts","V40"]
[null,null,null,null,null,"Lesley Ann Knappy","V50"]
[null,null,null,null,null,"Liam Spencer","V40"]
[null,null,null,null,null,"Linda Green","V60"]
[null,null,null,null,null,"Liz Crosland","V40"]
[null,null,null,null,null,"Lorna Hubbard","V30"]
[null,null,null,null,null,"Lorraine Bamfield","V40"]
[null,null,null,null,null,"Louise Marriott","V30"]
[null,null,null,null,null,"Luisa Lauren","V50"]
[null,null,null,null,null,"Lukas Lee","V40"]
[null,null,null,null,null,"Lyn Wigfield","V70"]
[null,null,null,null,null,"Lynn Murphy","V40"]
[null,null,null,null,null,"Maria Walker","V50"]
[null,null,null,null,null,"Mark Knowles","V40"]
[null,null,null,null,null,"Mark Redhead","V50"]
[null,null,null,null,null,"Mark Whitehead","V40"]
[null,null,null,null,null,"Marko Gvero","V40"]
[null,null,null,null,null,"Mary Hodgkiss","V60"]
[null,null,null,null,null,"Matt House","V30"]
[null,null,null,null,null,"Matthew Clayton-Stead","V30"]
[null,null,null,null,null,"Melissa Brown","V40"]
[null,null,null,null,null,"Mike Tomison","V50"]
[null,null,null,null,null,"Mike Watson","V50"]
[null,null,null,null,null,"Neil Edward Palmer","V50"]
[null,null,null,null,null,"Neil Palmer","V50"]
[null,null,null,null,null,"Neville Whittingham","V50"]
[null,null,null,null,null,"Nick Brown","V40"]
[null,null,null,null,null,"Nick Dewell","V40"]
[null,null,null,null,null,"Nigel Atkinson","V40"]
[null,null,null,null,null,"Nikhola Haley","V40"]
[null,null,null,null,null,"P Margaret Marsden","V50"]
[null,null,null,null,null,"Paul Crabtree","V40"]
[null,null,null,null,null,"Paul King","V40"]
[null,null,null,null,null,"Paul Morris","V60"]
[null,null,null,null,null,"Paul Sessford","V50"]
[null,null,null,null,null,"Paul Wilson","V40"]
[null,null,null,null,null,"Paula Williams","V40"]
[null,null,null,null,null,"Peter Bramham","V60"]
[null,null,null,null,null,"Peter Lloyd","V30"]
[null,null,null,null,null,"Peter McDermott","V60"]
[null,null,null,null,null,"Peter Mitchell","V70"]
[null,null,null,null,null,"Peter Smith","V30"]
[null,null,null,null,null,"Peter Thompson","V50"]
[null,null,null,null,null,"Pin Dhillon-Downey","V40"]
[null,null,null,null,null,"Pippa Barret","S"]
[null,null,null,null,null,"Rachel Gasior","V40"]
[null,null,null,null,null,"Rachel Lyles","V30"]
[null,null,null,null,null,"Rachel Russell","V40"]
[null,null,null,null,null,"Rachel Welsh","V40"]
[null,null,null,null,null,"Ray Causten","V50"]
[null,null,null,null,null,"Ria Bright","V40"]
[null,null,null,null,null,"Richard Ayrton","V40"]
[null,null,null,null,null,"Richard Butter","V40"]
[null,null,null,null,null,"Richard Hindle","V60"]
[null,null,null,null,null,"Richard Lund","V50"]
[null,null,null,null,null,"Richard Taylor","V40"]
[null,null,null,null,null,"Robert Hudson","V40"]
[null,null,null,null,null,"Robert Thompson","J"]
[null,null,null,null,null,"Robin  OConnor","V60"]
[null,null,null,null,null,"Rosemary Cook","V40"]
[null,null,null,null,null,"Rosie Hellawell","S"]
[null,null,null,null,null,"Russell Fairhurst","V50"]
[null,null,null,null,null,"Sally Fretwell","V50"]
[null,null,null,null,null,"Sam Cann","V50"]
[null,null,null,null,null,"Samantha Knowles","V40"]
[null,null,null,null,null,"Sara  Abbott","V30"]
[null,null,null,null,null,"Sarah Bagley","S"]
[null,null,null,null,null,"Sarah Meikle","V40"]
[null,null,null,null,null,"Sarah O'Sullivan","V40"]
[null,null,null,null,null,"Sarah Peel","V40"]
[null,null,null,null,null,"Sarah Quinlan","S"]
[null,null,null,null,null,"Scott Bairstow","V40"]
[null,null,null,null,null,"Sean O'Driscoll","V30"]
[null,null,null,null,null,"Shane Beaumont","V50"]
[null,null,null,null,null,"Sharon Hudson","V40"]
[null,null,null,null,null,"Sharon Ridding","V50"]
[null,null,null,null,null,"Shaun Wilkinson","V50"]
[null,null,null,null,null,"Simon Bellwood ","V50"]
[null,null,null,null,null,"Simon Chester","V40"]
[null,null,null,null,null,"Simon Farrar","V50"]
[null,null,null,null,null,"Simon Lloyd","V40"]
[null,null,null,null,null,"Simon Packham","V50"]
[null,null,null,null,null,"Simon Smallwood","V50"]
[null,null,null,null,null,"Simon Wheeler","V40"]
[null,null,null,null,null,"Stephanie French","V40"]
[null,null,null,null,null,"Stephen  Beaufort Jones","S"]
[null,null,null,null,null,"Stephen Bell","S"]
[null,null,null,null,null,"Stephen Thompson","V40"]
[null,null,null,null,null,"Steve Anthony Curtis","V50"]
[null,null,null,null,null,"Steve Carter ","V60"]
[null,null,null,null,null,"Steve Robinson","V50"]
[null,null,null,null,null,"Steven Shuttleworth","V40"]
[null,null,null,null,null,"Stuart Preston","V30"]
[null,null,null,null,null,"Stuart Walton","V40"]
[null,null,null,null,null,"Sue Park","V50"]
[null,null,null,null,null,"Sue Redhead","V50"]
[null,null,null,null,null,"Sue Straw","V40"]
[null,null,null,null,null,"Susan Weeden","V60"]
[null,null,null,null,null,"Tim Clegg","V50"]
[null,null,null,null,null,"Tim Thom","V50"]
[null,null,null,null,null,"Tim Whitehead","V40"]
[null,null,null,null,null,"Tina Kelly","V40"]
[null,null,null,null,null,"Tizz Woffenden","V40"]
[null,null,null,null,null,"Tom Sessford","S"]
[null,null,null,null,null,"Tony Booth","V40"]
[null,null,null,null,null,"Tracey Hodgson","V30"]
[null,null,null,null,null,"Tracy (UKA 2719727) Bailey","V40"]
[null,null,null,null,null,"Trevor F Kearton","V50"]
[null,null,null,null,null,"Trisha Gavins","V50"]
[null,null,null,null,null,"Victor M Bamfield","V40"]
[null,null,null,null,null,"Victoria Bairstow","V40"]
[null,null,null,null,null,"Victoria Wadsworth ","V40"]
[null,null,null,null,null,"Vincent (Vinnie) Procter","V40"]
[null,null,null,null,null,"Wendy Ashley","V50"]
[null,null,null,null,null,"Will Smith","V40"]
[null,null,null,null,null,"Ying Tomison","V40"]
[null,null,null,null,null,"Zara Rhian Knappy","S"]